ACCESSION: MSBNK-Waters-WA001672
RECORD_TITLE: Digoxigenin; LC-ESI-Q; MS; POS; 60 V
DATE: 2016.01.19 (Created 2007.08.01, modified 2011.05.06)
AUTHORS: Nihon Waters K.K.
LICENSE: CC BY-NC

CH$NAME: Digoxigenin
CH$COMPOUND_CLASS: N/A
CH$FORMULA: C23H34O5
CH$EXACT_MASS: 390.24062
CH$SMILES: O=C(O5)C=C(C5)C(C4)C(C)(C(O)3)C(O)(C4)C([H])(C1)C([H])(C3)C(C)(C2)C([H])(CC(O)C2)C1
CH$IUPAC: InChI=1S/C23H34O5/c1-21-7-5-15(24)10-14(21)3-4-17-18(21)11-19(25)22(2)16(6-8-23(17,22)27)13-9-20(26)28-12-13/h9,14-19,24-25,27H,3-8,10-12H2,1-2H3/t14-,15+,16-,17-,18+,19-,21+,22+,23+/m1/s1
CH$LINK: CAS 1672-46-4
CH$LINK: INCHIKEY SHIBSTMRCDJXLN-KCZCNTNESA-N
CH$LINK: COMPTOX DTXSID6051778

AC$INSTRUMENT: ZQ, Waters
AC$INSTRUMENT_TYPE: LC-ESI-Q
AC$MASS_SPECTROMETRY: MS_TYPE MS
AC$MASS_SPECTROMETRY: ION_MODE POSITIVE
AC$MASS_SPECTROMETRY: IONIZATION ESI
AC$CHROMATOGRAPHY: RETENTION_TIME 12.620 min
AC$CHROMATOGRAPHY: COLUMN_NAME 2.1 mm id - 3. 5{mu}m XTerra C18MS
AC$CHROMATOGRAPHY: COLUMN_TEMPERATURE 35 C
AC$CHROMATOGRAPHY: SAMPLING_CONE 60 V

MS$DATA_PROCESSING: FIND_PEAK ignore rel.int. < 5

PK$SPLASH: splash10-0btj-0923000000-921437397dcb665fc448
PK$NUM_PEAK: 164
PK$PEAK: m/z int. rel.int.
  105 321 321
  107 364 364
  108 12 12
  109 239 239
  110 24 24
  111 63 63
  115 8 8
  117 71 71
  119 235 235
  120 16 16
  121 204 204
  122 82 82
  123 51 51
  125 212 212
  126 12 12
  129 24 24
  130 8 8
  131 168 168
  132 8 8
  133 259 259
  134 20 20
  135 149 149
  137 20 20
  139 20 20
  141 27 27
  143 149 149
  144 12 12
  145 266 266
  146 35 35
  147 564 564
  148 55 55
  149 82 82
  150 16 16
  151 27 27
  153 349 349
  154 24 24
  155 262 262
  156 20 20
  157 137 137
  158 8 8
  159 251 251
  160 24 24
  161 827 827
  162 71 71
  163 227 227
  164 24 24
  165 24 24
  166 8 8
  167 47 47
  169 47 47
  171 94 94
  172 8 8
  173 118 118
  174 8 8
  175 125 125
  176 12 12
  177 110 110
  179 24 24
  181 35 35
  182 12 12
  183 82 82
  184 12 12
  185 145 145
  186 16 16
  187 133 133
  188 8 8
  189 317 317
  190 51 51
  191 43 43
  193 16 16
  195 67 67
  197 82 82
  198 12 12
  199 121 121
  200 24 24
  201 121 121
  202 24 24
  203 71 71
  204 12 12
  205 12 12
  207 39 39
  209 67 67
  210 8 8
  211 74 74
  212 12 12
  213 98 98
  214 12 12
  215 74 74
  216 16 16
  217 35 35
  221 35 35
  223 47 47
  225 39 39
  227 98 98
  228 16 16
  229 153 153
  230 24 24
  231 31 31
  233 12 12
  235 39 39
  236 8 8
  237 27 27
  238 8 8
  239 27 27
  241 74 74
  242 8 8
  243 102 102
  244 12 12
  245 12 12
  247 12 12
  249 31 31
  251 39 39
  253 51 51
  255 86 86
  256 12 12
  257 12 12
  259 16 16
  261 16 16
  263 35 35
  265 12 12
  267 20 20
  268 8 8
  269 27 27
  271 16 16
  272 8 8
  273 12 12
  275 31 31
  277 90 90
  278 20 20
  279 8 8
  281 51 51
  282 12 12
  283 20 20
  285 8 8
  291 114 114
  292 20 20
  293 12 12
  295 39 39
  301 20 20
  309 145 145
  310 27 27
  311 24 24
  319 110 110
  320 31 31
  327 8 8
  337 999 999
  338 243 243
  339 31 31
  355 803 803
  356 168 168
  357 12 12
  373 266 266
  374 55 55
  391 274 274
  392 51 51
  393 12 12
  408 27 27
  413 51 51
  414 35 35
  429 180 180
  430 20 20
  431 8 8
  432 24 24
  454 27 27