ACCESSION: MSBNK-Waters-WA001719
RECORD_TITLE: Chlorproethazine; LC-ESI-Q; MS; POS; 75 V
DATE: 2016.01.19 (Created 2007.08.01, modified 2011.05.06)
AUTHORS: Nihon Waters K.K.
LICENSE: CC BY-NC

CH$NAME: Chlorproethazine
CH$COMPOUND_CLASS: N/A
CH$FORMULA: C19H23ClN2S
CH$EXACT_MASS: 346.12705
CH$SMILES: CCN(CC)CCCN(c21)c(c3)c(ccc(Cl)3)Sc(cccc2)1
CH$IUPAC: InChI=1S/C19H23ClN2S/c1-3-21(4-2)12-7-13-22-16-8-5-6-9-18(16)23-19-11-10-15(20)14-17(19)22/h5-6,8-11,14H,3-4,7,12-13H2,1-2H3
CH$LINK: CAS 84-01-5
CH$LINK: INCHIKEY DBOUGBAQLIXZLV-UHFFFAOYSA-N
CH$LINK: COMPTOX DTXSID80232882

AC$INSTRUMENT: ZQ, Waters
AC$INSTRUMENT_TYPE: LC-ESI-Q
AC$MASS_SPECTROMETRY: MS_TYPE MS
AC$MASS_SPECTROMETRY: ION_MODE POSITIVE
AC$MASS_SPECTROMETRY: IONIZATION ESI
AC$CHROMATOGRAPHY: RETENTION_TIME 15.870 min
AC$CHROMATOGRAPHY: COLUMN_NAME 2.1 mm id - 3. 5{mu}m XTerra C18MS
AC$CHROMATOGRAPHY: COLUMN_TEMPERATURE 35 C
AC$CHROMATOGRAPHY: SAMPLING_CONE 75 V

MS$DATA_PROCESSING: FIND_PEAK ignore rel.int. < 5

PK$SPLASH: splash10-03di-0590000000-91ff4f13e43ad307567d
PK$NUM_PEAK: 104
PK$PEAK: m/z int. rel.int.
  100 24 24
  105 8 8
  106 20 20
  109 16 16
  112 47 47
  114 999 999
  115 55 55
  117 31 31
  122 8 8
  124 16 16
  130 16 16
  132 8 8
  133 20 20
  136 27 27
  148 16 16
  149 16 16
  150 8 8
  154 12 12
  162 8 8
  164 8 8
  166 43 43
  167 90 90
  168 16 16
  177 8 8
  178 8 8
  179 8 8
  180 63 63
  181 12 12
  182 24 24
  183 16 16
  184 8 8
  186 20 20
  187 8 8
  188 8 8
  194 35 35
  195 63 63
  196 262 262
  197 27 27
  198 63 63
  199 35 35
  200 71 71
  201 12 12
  202 8 8
  205 16 16
  206 47 47
  207 35 35
  209 12 12
  210 35 35
  211 208 208
  212 86 86
  213 39 39
  214 725 725
  215 172 172
  216 200 200
  217 20 20
  219 8 8
  221 8 8
  222 35 35
  223 35 35
  224 39 39
  225 39 39
  226 16 16
  227 24 24
  228 219 219
  229 31 31
  230 24 24
  232 102 102
  233 63 63
  234 47 47
  235 27 27
  237 27 27
  238 55 55
  239 223 223
  240 55 55
  241 39 39
  242 31 31
  243 8 8
  244 27 27
  246 337 337
  247 39 39
  248 137 137
  249 20 20
  250 8 8
  251 8 8
  253 8 8
  254 31 31
  255 67 67
  256 39 39
  257 12 12
  258 8 8
  259 8 8
  260 8 8
  262 8 8
  269 24 24
  270 8 8
  272 31 31
  273 24 24
  274 27 27
  275 12 12
  276 8 8
  329 8 8
  343 12 12
  345 8 8
  347 8 8