ACCESSION: MSBNK-Waters-WA001743
RECORD_TITLE: 10-Methoxycarbamazepine; LC-ESI-Q; MS; POS; 15 V
DATE: 2016.01.19 (Created 2007.08.01, modified 2011.05.06)
AUTHORS: Nihon Waters K.K.
LICENSE: CC BY-NC

CH$NAME: 10-Methoxycarbamazepine
CH$COMPOUND_CLASS: N/A
CH$FORMULA: C16H14N2O2
CH$EXACT_MASS: 266.10553
CH$SMILES: COC(=C1)c(c3)c(ccc3)N(C(N)=O)c(c2)c(ccc2)1
CH$IUPAC: InChI=1S/C16H14N2O2/c1-20-15-10-11-6-2-4-8-13(11)18(16(17)19)14-9-5-3-7-12(14)15/h2-10H,1H3,(H2,17,19)
CH$LINK: CAS 28721-09-7
CH$LINK: INCHIKEY PIZOFBKQWNPKDK-UHFFFAOYSA-N
CH$LINK: COMPTOX DTXSID90182884

AC$INSTRUMENT: ZQ, Waters
AC$INSTRUMENT_TYPE: LC-ESI-Q
AC$MASS_SPECTROMETRY: MS_TYPE MS
AC$MASS_SPECTROMETRY: ION_MODE POSITIVE
AC$MASS_SPECTROMETRY: IONIZATION ESI
AC$CHROMATOGRAPHY: RETENTION_TIME 15.350 min
AC$CHROMATOGRAPHY: COLUMN_NAME 2.1 mm id - 3. 5{mu}m XTerra C18MS
AC$CHROMATOGRAPHY: COLUMN_TEMPERATURE 35 C
AC$CHROMATOGRAPHY: SAMPLING_CONE 15 V

MS$DATA_PROCESSING: FIND_PEAK ignore rel.int. < 5

PK$SPLASH: splash10-014i-0090020000-bb7e34755963d38884fc
PK$NUM_PEAK: 12
PK$PEAK: m/z int. rel.int.
  253 8 8
  267 999 999
  268 204 204
  269 20 20
  289 12 12
  305 8 8
  335 27 27
  533 192 192
  534 63 63
  535 12 12
  555 71 71
  556 35 35