ACCESSION: MSBNK-Waters-WA001747
RECORD_TITLE: Albendazole sulfone; LC-ESI-Q; MS; POS; 30 V
DATE: 2016.01.19 (Created 2007.08.01, modified 2011.09.27)
AUTHORS: Nihon Waters K.K.
LICENSE: CC BY-NC

CH$NAME: Albendazole sulfone
CH$COMPOUND_CLASS: N/A
CH$FORMULA: C12H15N3O4S
CH$EXACT_MASS: 297.07833
CH$SMILES: CCCS(=O)(=O)C1=CC2=C(C=C1)N=C(N2)NC(=O)OC
CH$IUPAC: InChI=1S/C12H15N3O4S/c1-3-6-20(17,18)8-4-5-9-10(7-8)14-11(13-9)15-12(16)19-2/h4-5,7H,3,6H2,1-2H3,(H2,13,14,15,16)
CH$LINK: CAS 75184-71-3
CH$LINK: INCHIKEY CLSJYOLYMZNKJB-UHFFFAOYSA-N
CH$LINK: COMPTOX DTXSID00226167

AC$INSTRUMENT: ZQ, Waters
AC$INSTRUMENT_TYPE: LC-ESI-Q
AC$MASS_SPECTROMETRY: MS_TYPE MS
AC$MASS_SPECTROMETRY: ION_MODE POSITIVE
AC$MASS_SPECTROMETRY: IONIZATION ESI
AC$CHROMATOGRAPHY: RETENTION_TIME 13.180 min
AC$CHROMATOGRAPHY: COLUMN_NAME 2.1 mm id - 3. 5{mu}m XTerra C18MS
AC$CHROMATOGRAPHY: COLUMN_TEMPERATURE 35 C
AC$CHROMATOGRAPHY: SAMPLING_CONE 30 V

MS$DATA_PROCESSING: FIND_PEAK ignore rel.int. < 5

PK$SPLASH: splash10-0002-0392000000-d8694c8bfbf84d36e055
PK$ANNOTATION: m/z type
  226 [M+H]+
  336 [M+K]+
PK$NUM_PEAK: 20
PK$PEAK: m/z int. rel.int.
  104 8 8
  113 16 16
  115 12 12
  116 8 8
  122 8 8
  160 149 149
  161 27 27
  192 168 168
  193 20 20
  266 59 59
  267 12 12
  298 999 999
  299 145 145
  300 63 63
  301 8 8
  320 8 8
  336 192 192
  337 24 24
  338 16 16
  342 8 8