ACCESSION: MSBNK-Waters-WA001793
RECORD_TITLE: Bepridil; LC-ESI-Q; MS; POS; 30 V
DATE: 2016.01.19 (Created 2007.08.01, modified 2011.05.06)
AUTHORS: Nihon Waters K.K.
LICENSE: CC BY-NC

CH$NAME: Bepridil
CH$COMPOUND_CLASS: N/A
CH$FORMULA: C24H34N2O
CH$EXACT_MASS: 366.26711
CH$SMILES: CC(C)COCC(CN(Cc(c3)cccc3)c(c2)cccc2)N(C1)CCC1
CH$IUPAC: InChI=1S/C24H34N2O/c1-21(2)19-27-20-24(25-15-9-10-16-25)18-26(23-13-7-4-8-14-23)17-22-11-5-3-6-12-22/h3-8,11-14,21,24H,9-10,15-20H2,1-2H3
CH$LINK: CAS 64706-54-3
CH$LINK: INCHIKEY UIEATEWHFDRYRU-UHFFFAOYSA-N
CH$LINK: COMPTOX DTXSID3022663

AC$INSTRUMENT: ZQ, Waters
AC$INSTRUMENT_TYPE: LC-ESI-Q
AC$MASS_SPECTROMETRY: MS_TYPE MS
AC$MASS_SPECTROMETRY: ION_MODE POSITIVE
AC$MASS_SPECTROMETRY: IONIZATION ESI
AC$CHROMATOGRAPHY: RETENTION_TIME 17.200 min
AC$CHROMATOGRAPHY: COLUMN_NAME 2.1 mm id - 3. 5{mu}m XTerra C18MS
AC$CHROMATOGRAPHY: COLUMN_TEMPERATURE 35 C
AC$CHROMATOGRAPHY: SAMPLING_CONE 30 V

MS$DATA_PROCESSING: FIND_PEAK ignore rel.int. < 5

PK$SPLASH: splash10-0159-0609000000-2a759f4d43be99cdbe88
PK$NUM_PEAK: 13
PK$PEAK: m/z int. rel.int.
  170 43 43
  184 772 772
  185 90 90
  186 8 8
  196 12 12
  277 8 8
  291 8 8
  296 35 35
  297 8 8
  365 63 63
  367 999 999
  368 259 259
  369 35 35