ACCESSION: MSBNK-Waters-WA001830
RECORD_TITLE: Antrafenine; LC-ESI-Q; MS; POS; 45 V
DATE: 2016.01.19 (Created 2007.08.01, modified 2011.05.06)
AUTHORS: Nihon Waters K.K.
LICENSE: CC BY-NC

CH$NAME: Antrafenine
CH$COMPOUND_CLASS: N/A
CH$FORMULA: C30H26F6N4O2
CH$EXACT_MASS: 588.19600
CH$SMILES: n(c12)ccc(Nc(c3C(=O)OCCN(C4)CCN(c(c5)cccc5C(F)(F)F)C4)cccc3)c1ccc(C(F)(F)F)c2
CH$IUPAC: InChI=1S/C30H26F6N4O2/c31-29(32,33)20-4-3-5-22(18-20)40-14-12-39(13-15-40)16-17-42-28(41)24-6-1-2-7-25(24)38-26-10-11-37-27-19-21(30(34,35)36)8-9-23(26)27/h1-11,18-19H,12-17H2,(H,37,38)
CH$LINK: CAS 55300-29-3
CH$LINK: INCHIKEY NWGGKKGAFZIVBJ-UHFFFAOYSA-N
CH$LINK: COMPTOX DTXSID60203833

AC$INSTRUMENT: ZQ, Waters
AC$INSTRUMENT_TYPE: LC-ESI-Q
AC$MASS_SPECTROMETRY: MS_TYPE MS
AC$MASS_SPECTROMETRY: ION_MODE POSITIVE
AC$MASS_SPECTROMETRY: IONIZATION ESI
AC$CHROMATOGRAPHY: RETENTION_TIME 17.530 min
AC$CHROMATOGRAPHY: COLUMN_NAME 2.1 mm id - 3. 5{mu}m XTerra C18MS
AC$CHROMATOGRAPHY: COLUMN_TEMPERATURE 35 C
AC$CHROMATOGRAPHY: SAMPLING_CONE 45 V

MS$DATA_PROCESSING: FIND_PEAK ignore rel.int. < 5

PK$SPLASH: splash10-0a4i-0090020000-f2df11ea4b442014e6c2
PK$NUM_PEAK: 10
PK$PEAK: m/z int. rel.int.
  188 12 12
  200 8 8
  257 999 999
  258 141 141
  259 12 12
  275 8 8
  315 24 24
  589 266 266
  590 90 90
  591 16 16