ACCESSION: MSBNK-Waters-WA001877
RECORD_TITLE: Topiramate; LC-ESI-Q; MS; NEG; 30 V
DATE: 2016.01.19 (Created 2007.08.01, modified 2012.05.21)
AUTHORS: Nihon Waters K.K.
LICENSE: CC BY-NC

CH$NAME: Topiramate
CH$COMPOUND_CLASS: N/A
CH$FORMULA: C12H21NO8S
CH$EXACT_MASS: 339.09879
CH$SMILES: NS(=O)(=O)OCC(O2)(O3)C([H])(OC(C)(C)3)C([H])(O1)C([H])(C2)OC(C)(C)1
CH$IUPAC: InChI=1S/C12H21NO8S/c1-10(2)18-7-5-16-12(6-17-22(13,14)15)9(8(7)19-10)20-11(3,4)21-12/h7-9H,5-6H2,1-4H3,(H2,13,14,15)/t7-,8-,9+,12+/m1/s1
CH$LINK: CAS 97240-79-4
CH$LINK: INCHIKEY KJADKKWYZYXHBB-XBWDGYHZSA-N
CH$LINK: COMPTOX DTXSID8023688

AC$INSTRUMENT: ZQ, Waters
AC$INSTRUMENT_TYPE: LC-ESI-Q
AC$MASS_SPECTROMETRY: MS_TYPE MS
AC$MASS_SPECTROMETRY: ION_MODE NEGATIVE
AC$MASS_SPECTROMETRY: IONIZATION ESI
AC$CHROMATOGRAPHY: RETENTION_TIME 14.320 min
AC$CHROMATOGRAPHY: COLUMN_NAME 2.1 mm id - 3. 5{mu}m XTerra C18MS
AC$CHROMATOGRAPHY: COLUMN_TEMPERATURE 35 C
AC$CHROMATOGRAPHY: SAMPLING_CONE 30 V

MS$DATA_PROCESSING: FIND_PEAK ignore rel.int. < 5

PK$SPLASH: splash10-000i-0649000000-693104ffcd78d30c2214
PK$NUM_PEAK: 101
PK$PEAK: m/z int. rel.int.
  109 12 12
  112 12 12
  115 12 12
  117 12 12
  119 12 12
  121 16 16
  123 20 20
  124 43 43
  126 106 106
  128 43 43
  130 20 20
  133 16 16
  139 12 12
  141 39 39
  146 133 133
  147 290 290
  148 24 24
  150 20 20
  155 12 12
  159 12 12
  161 31 31
  165 24 24
  168 16 16
  169 12 12
  170 20 20
  174 16 16
  175 12 12
  176 12 12
  181 12 12
  184 12 12
  185 12 12
  187 51 51
  190 16 16
  191 24 24
  193 12 12
  197 16 16
  199 24 24
  203 16 16
  204 16 16
  206 24 24
  209 12 12
  210 12 12
  217 12 12
  220 59 59
  222 35 35
  224 12 12
  227 12 12
  229 12 12
  231 16 16
  233 43 43
  241 12 12
  243 16 16
  244 12 12
  246 16 16
  247 16 16
  251 16 16
  258 24 24
  260 12 12
  262 12 12
  264 12 12
  266 24 24
  273 16 16
  279 24 24
  281 20 20
  283 16 16
  285 20 20
  287 20 20
  288 16 16
  290 31 31
  293 12 12
  294 12 12
  295 12 12
  297 24 24
  298 12 12
  303 12 12
  309 16 16
  313 16 16
  318 16 16
  323 12 12
  338 999 999
  339 129 129
  343 20 20
  345 12 12
  350 12 12
  352 16 16
  353 16 16
  354 12 12
  356 12 12
  358 16 16
  360 24 24
  362 12 12
  363 12 12
  365 16 16
  366 12 12
  370 12 12
  376 24 24
  378 20 20
  380 12 12
  382 35 35
  387 20 20
  390 24 24