ACCESSION: MSBNK-Waters-WA001921
RECORD_TITLE: Fenozolone; LC-ESI-Q; MS; POS; 75 V
DATE: 2016.01.19 (Created 2007.08.01, modified 2012.05.21)
AUTHORS: Nihon Waters K.K.
LICENSE: CC BY-NC

CH$NAME: Fenozolone
CH$COMPOUND_CLASS: N/A
CH$FORMULA: C11H12N2O2
CH$EXACT_MASS: 204.08988
CH$SMILES: CCNC(=N2)OC(C(=O)2)c(c1)cccc1
CH$IUPAC: InChI=1S/C11H12N2O2/c1-2-12-11-13-10(14)9(15-11)8-6-4-3-5-7-8/h3-7,9H,2H2,1H3,(H,12,13,14)
CH$LINK: CAS 15302-16-6
CH$LINK: INCHIKEY RXOIEVSUURELPG-UHFFFAOYSA-N

AC$INSTRUMENT: ZQ, Waters
AC$INSTRUMENT_TYPE: LC-ESI-Q
AC$MASS_SPECTROMETRY: MS_TYPE MS
AC$MASS_SPECTROMETRY: ION_MODE POSITIVE
AC$MASS_SPECTROMETRY: IONIZATION ESI
AC$CHROMATOGRAPHY: RETENTION_TIME 13.040 min
AC$CHROMATOGRAPHY: COLUMN_NAME 2.1 mm id - 3. 5{mu}m XTerra C18MS
AC$CHROMATOGRAPHY: COLUMN_TEMPERATURE 35 C
AC$CHROMATOGRAPHY: SAMPLING_CONE 75 V

MS$DATA_PROCESSING: FIND_PEAK ignore rel.int. < 5

PK$SPLASH: splash10-0a4i-0900000000-5887d3a576ec1099e11b
PK$ANNOTATION: m/z type
  227 [M+Na]+
PK$NUM_PEAK: 13
PK$PEAK: m/z int. rel.int.
  104 16 16
  105 137 137
  106 999 999
  107 82 82
  115 12 12
  116 8 8
  117 12 12
  118 474 474
  119 39 39
  132 31 31
  134 411 411
  135 47 47
  227 24 24