ACCESSION: MSBNK-Waters-WA001967
RECORD_TITLE: Biperiden; LC-ESI-Q; MS; POS; 15 V, 30 V
DATE: 2016.01.19 (Created 2007.08.01, modified 2011.05.06)
AUTHORS: Nihon Waters K.K.
LICENSE: CC BY-NC

CH$NAME: Biperiden
CH$COMPOUND_CLASS: N/A
CH$FORMULA: C21H29NO
CH$EXACT_MASS: 311.22491
CH$SMILES: C(C4)CCN(C4)CCC(O)(c(c3)cccc3)C(C1)C(C=2)CC(C2)1
CH$IUPAC: InChI=1S/C21H29NO/c23-21(19-7-3-1-4-8-19,11-14-22-12-5-2-6-13-22)20-16-17-9-10-18(20)15-17/h1,3-4,7-10,17-18,20,23H,2,5-6,11-16H2
CH$LINK: CAS 514-65-8
CH$LINK: INCHIKEY YSXKPIUOCJLQIE-UHFFFAOYSA-N
CH$LINK: COMPTOX DTXSID6022680

AC$INSTRUMENT: ZQ, Waters
AC$INSTRUMENT_TYPE: LC-ESI-Q
AC$MASS_SPECTROMETRY: MS_TYPE MS
AC$MASS_SPECTROMETRY: ION_MODE POSITIVE
AC$MASS_SPECTROMETRY: IONIZATION ESI
AC$CHROMATOGRAPHY: RETENTION_TIME 14.430 min
AC$CHROMATOGRAPHY: COLUMN_NAME 2.1 mm id - 3. 5{mu}m XTerra C18MS
AC$CHROMATOGRAPHY: COLUMN_TEMPERATURE 35 C
AC$CHROMATOGRAPHY: SAMPLING_CONE 15 V, 30 V

MS$DATA_PROCESSING: FIND_PEAK ignore rel.int. < 5

PK$SPLASH: splash10-03di-0009000000-56196a009ab02abcc89b
PK$NUM_PEAK: 3
PK$PEAK: m/z int. rel.int.
  312 999 999
  313 219 219
  314 27 27