ACCESSION: MSBNK-Waters-WA002044
RECORD_TITLE: Pipotiazine (oxide); LC-ESI-Q; MS; POS; 15 V
DATE: 2016.01.19 (Created 2007.08.01, modified 2011.05.06)
AUTHORS: Nihon Waters K.K.
LICENSE: CC BY-NC

CH$NAME: Pipotiazine (oxide)
CH$COMPOUND_CLASS: N/A
CH$FORMULA: C24H33N3O3S2
CH$EXACT_MASS: 475.19633
CH$SMILES: OCCC(C4)CCN(C4)CCCN(c21)c(c3)c(ccc3S(=O)(=O)N(C)C)Sc(cccc2)1
CH$IUPAC: InChI=1S/C24H33N3O3S2/c1-25(2)32(29,30)20-8-9-24-22(18-20)27(21-6-3-4-7-23(21)31-24)14-5-13-26-15-10-19(11-16-26)12-17-28/h3-4,6-9,18-19,28H,5,10-17H2,1-2H3
CH$LINK: CAS 39860-99-6
CH$LINK: INCHIKEY JOMHSQGEWSNUKU-UHFFFAOYSA-N
CH$LINK: COMPTOX DTXSID40192913

AC$INSTRUMENT: ZQ, Waters
AC$INSTRUMENT_TYPE: LC-ESI-Q
AC$MASS_SPECTROMETRY: MS_TYPE MS
AC$MASS_SPECTROMETRY: ION_MODE POSITIVE
AC$MASS_SPECTROMETRY: IONIZATION ESI
AC$CHROMATOGRAPHY: RETENTION_TIME 14.420 min
AC$CHROMATOGRAPHY: COLUMN_NAME 2.1 mm id - 3. 5{mu}m XTerra C18MS
AC$CHROMATOGRAPHY: COLUMN_TEMPERATURE 35 C
AC$CHROMATOGRAPHY: SAMPLING_CONE 15 V

MS$DATA_PROCESSING: FIND_PEAK ignore rel.int. < 5

PK$SPLASH: splash10-004i-0000900000-f4ad85b492a2b20d9458
PK$NUM_PEAK: 7
PK$PEAK: m/z int. rel.int.
  476 999 999
  477 212 212
  478 129 129
  479 16 16
  492 102 102
  493 27 27
  494 12 12