ACCESSION: MSBNK-Waters-WA002087
RECORD_TITLE: Loxapine-7-methoxy; LC-ESI-Q; MS; POS; 90 V
DATE: 2016.01.19 (Created 2007.08.01, modified 2011.05.06)
AUTHORS: Nihon Waters K.K.
LICENSE: CC BY-NC

CH$NAME: Loxapine-7-methoxy
CH$COMPOUND_CLASS: N/A
CH$FORMULA: C19H20ClN3O2
CH$EXACT_MASS: 357.12440
CH$SMILES: COc(c4)cc(O1)c(c4)N=C(N(C3)CCN(C)C3)c(c2)c(ccc(Cl)2)1
CH$IUPAC: InChI=1S/C19H20ClN3O2/c1-22-7-9-23(10-8-22)19-15-11-13(20)3-6-17(15)25-18-12-14(24-2)4-5-16(18)21-19/h3-6,11-12H,7-10H2,1-2H3
CH$LINK: INCHIKEY RQVJIDOFDAAWDW-UHFFFAOYSA-N

AC$INSTRUMENT: ZQ, Waters
AC$INSTRUMENT_TYPE: LC-ESI-Q
AC$MASS_SPECTROMETRY: MS_TYPE MS
AC$MASS_SPECTROMETRY: ION_MODE POSITIVE
AC$MASS_SPECTROMETRY: IONIZATION ESI
AC$CHROMATOGRAPHY: RETENTION_TIME 13.770 min
AC$CHROMATOGRAPHY: COLUMN_NAME 2.1 mm id - 3. 5{mu}m XTerra C18MS
AC$CHROMATOGRAPHY: COLUMN_TEMPERATURE 35 C
AC$CHROMATOGRAPHY: SAMPLING_CONE 90 V

MS$DATA_PROCESSING: FIND_PEAK ignore rel.int. < 5

PK$SPLASH: splash10-0ab9-0091000000-edf986258a54722b98e8
PK$NUM_PEAK: 90
PK$PEAK: m/z int. rel.int.
  108 12 12
  123 20 20
  134 67 67
  138 20 20
  148 39 39
  149 153 153
  150 12 12
  164 12 12
  167 12 12
  180 74 74
  187 16 16
  189 12 12
  193 43 43
  194 27 27
  195 31 31
  196 20 20
  197 16 16
  201 16 16
  202 16 16
  203 27 27
  204 20 20
  205 16 16
  206 12 12
  208 419 419
  209 43 43
  210 12 12
  215 63 63
  216 12 12
  217 39 39
  219 20 20
  221 24 24
  222 12 12
  223 999 999
  224 121 121
  225 12 12
  227 67 67
  228 24 24
  229 650 650
  230 227 227
  231 247 247
  232 82 82
  233 12 12
  237 12 12
  239 12 12
  241 24 24
  242 31 31
  243 157 157
  244 31 31
  245 71 71
  246 12 12
  249 51 51
  250 12 12
  251 12 12
  255 247 247
  256 63 63
  257 262 262
  258 627 627
  259 133 133
  260 223 223
  261 35 35
  262 12 12
  265 20 20
  266 16 16
  269 125 125
  270 27 27
  271 63 63
  272 20 20
  274 20 20
  283 43 43
  284 153 153
  285 55 55
  286 153 153
  287 31 31
  288 35 35
  295 31 31
  297 12 12
  299 24 24
  301 529 529
  302 78 78
  303 188 188
  304 24 24
  311 24 24
  312 31 31
  313 16 16
  327 133 133
  328 20 20
  329 47 47
  358 63 63
  359 12 12
  360 20 20