ACCESSION: MSBNK-Waters-WA002128
RECORD_TITLE: 8-Hydroxyamoxapine; LC-ESI-Q; MS; POS; 15 V, 30 V
DATE: 2016.01.19 (Created 2007.08.01, modified 2011.05.06)
AUTHORS: Nihon Waters K.K.
LICENSE: CC BY-NC

CH$NAME: 8-Hydroxyamoxapine
CH$COMPOUND_CLASS: N/A
CH$FORMULA: C17H16ClN3O2
CH$EXACT_MASS: 329.09310
CH$SMILES: Oc(c4)cc(N=1)c(c4)Oc(c3)c(cc(Cl)c3)C1N(C2)CCNC2
CH$IUPAC: InChI=1S/C17H16ClN3O2/c18-11-1-3-15-13(9-11)17(21-7-5-19-6-8-21)20-14-10-12(22)2-4-16(14)23-15/h1-4,9-10,19,22H,5-8H2
CH$LINK: CAS 61443-78-5
CH$LINK: INCHIKEY QDWNOKXUZTYVGO-UHFFFAOYSA-N
CH$LINK: COMPTOX DTXSID40210388

AC$INSTRUMENT: ZQ, Waters
AC$INSTRUMENT_TYPE: LC-ESI-Q
AC$MASS_SPECTROMETRY: MS_TYPE MS
AC$MASS_SPECTROMETRY: ION_MODE POSITIVE
AC$MASS_SPECTROMETRY: IONIZATION ESI
AC$CHROMATOGRAPHY: RETENTION_TIME 12.600 min
AC$CHROMATOGRAPHY: COLUMN_NAME 2.1 mm id - 3. 5{mu}m XTerra C18MS
AC$CHROMATOGRAPHY: COLUMN_TEMPERATURE 35 C
AC$CHROMATOGRAPHY: SAMPLING_CONE 15 V, 30 V

MS$DATA_PROCESSING: FIND_PEAK ignore rel.int. < 5

PK$SPLASH: splash10-001i-0009000000-934ea91cb9cb11eae75f
PK$NUM_PEAK: 5
PK$PEAK: m/z int. rel.int.
  330 999 999
  331 165 165
  332 353 353
  333 43 43
  344 12 12