ACCESSION: MSBNK-Waters-WA002134
RECORD_TITLE: Acepromazine (oxide); LC-ESI-Q; MS; POS; 90 V
DATE: 2016.01.19 (Created 2007.08.01, modified 2011.05.06)
AUTHORS: Nihon Waters K.K.
LICENSE: CC BY-NC

CH$NAME: Acepromazine (oxide)
CH$COMPOUND_CLASS: N/A
CH$FORMULA: C19H22N2OS
CH$EXACT_MASS: 326.14528
CH$SMILES: CN(C)CCCN(c21)c(c3)c(ccc(C(C)=O)3)Sc(cccc2)1
CH$IUPAC: InChI=1S/C19H22N2OS/c1-14(22)15-9-10-19-17(13-15)21(12-6-11-20(2)3)16-7-4-5-8-18(16)23-19/h4-5,7-10,13H,6,11-12H2,1-3H3
CH$LINK: CAS 61-00-7
CH$LINK: INCHIKEY NOSIYYJFMPDDSA-UHFFFAOYSA-N
CH$LINK: COMPTOX DTXSID1022552

AC$INSTRUMENT: ZQ, Waters
AC$INSTRUMENT_TYPE: LC-ESI-Q
AC$MASS_SPECTROMETRY: MS_TYPE MS
AC$MASS_SPECTROMETRY: ION_MODE POSITIVE
AC$MASS_SPECTROMETRY: IONIZATION ESI
AC$CHROMATOGRAPHY: RETENTION_TIME 14.070 min
AC$CHROMATOGRAPHY: COLUMN_NAME 2.1 mm id - 3. 5{mu}m XTerra C18MS
AC$CHROMATOGRAPHY: COLUMN_TEMPERATURE 35 C
AC$CHROMATOGRAPHY: SAMPLING_CONE 90 V

MS$DATA_PROCESSING: FIND_PEAK ignore rel.int. < 5

PK$SPLASH: splash10-00di-0290000000-71c6f74e62bc4c671a74
PK$NUM_PEAK: 44
PK$PEAK: m/z int. rel.int.
  106 12 12
  117 16 16
  167 47 47
  168 16 16
  178 20 20
  179 184 184
  180 153 153
  181 16 16
  191 12 12
  192 12 12
  193 12 12
  194 12 12
  197 59 59
  198 141 141
  199 55 55
  200 12 12
  204 31 31
  205 20 20
  206 165 165
  207 35 35
  208 12 12
  210 43 43
  211 192 192
  212 192 192
  213 27 27
  214 12 12
  222 999 999
  223 165 165
  224 74 74
  225 35 35
  226 63 63
  236 78 78
  238 74 74
  239 78 78
  240 302 302
  241 102 102
  242 24 24
  254 165 165
  255 31 31
  266 16 16
  267 12 12
  280 39 39
  281 12 12
  327 31 31