ACCESSION: MSBNK-Waters-WA002210
RECORD_TITLE: Olanzapine; LC-ESI-Q; MS; POS; 90 V
DATE: 2016.01.19 (Created 2007.08.01, modified 2011.05.06)
AUTHORS: Nihon Waters K.K.
LICENSE: CC BY-NC

CH$NAME: Olanzapine
CH$COMPOUND_CLASS: N/A
CH$FORMULA: C17H20N4S
CH$EXACT_MASS: 312.14087
CH$SMILES: CN(C4)CCN(C4)C(=N1)c(c3)c(sc(C)3)Nc(c2)c(ccc2)1
CH$IUPAC: InChI=1S/C17H20N4S/c1-12-11-13-16(21-9-7-20(2)8-10-21)18-14-5-3-4-6-15(14)19-17(13)22-12/h3-6,11,19H,7-10H2,1-2H3
CH$LINK: CAS 132539-06-1
CH$LINK: INCHIKEY KVWDHTXUZHCGIO-UHFFFAOYSA-N
CH$LINK: COMPTOX DTXSID9023388

AC$INSTRUMENT: ZQ, Waters
AC$INSTRUMENT_TYPE: LC-ESI-Q
AC$MASS_SPECTROMETRY: MS_TYPE MS
AC$MASS_SPECTROMETRY: ION_MODE POSITIVE
AC$MASS_SPECTROMETRY: IONIZATION ESI
AC$CHROMATOGRAPHY: RETENTION_TIME 10.350 min
AC$CHROMATOGRAPHY: COLUMN_NAME 2.1 mm id - 3. 5{mu}m XTerra C18MS
AC$CHROMATOGRAPHY: COLUMN_TEMPERATURE 35 C
AC$CHROMATOGRAPHY: SAMPLING_CONE 90 V

MS$DATA_PROCESSING: FIND_PEAK ignore rel.int. < 5

PK$SPLASH: splash10-01ot-0950000000-7cf21abd153cdee75f09
PK$NUM_PEAK: 71
PK$PEAK: m/z int. rel.int.
  101 12 12
  104 12 12
  106 12 12
  109 12 12
  115 59 59
  117 31 31
  118 12 12
  119 16 16
  133 12 12
  140 12 12
  142 59 59
  143 16 16
  146 31 31
  153 20 20
  154 31 31
  155 35 35
  160 16 16
  167 20 20
  168 16 16
  169 451 451
  170 59 59
  171 16 16
  173 67 67
  179 161 161
  180 360 360
  181 63 63
  182 24 24
  183 16 16
  185 12 12
  186 239 239
  187 47 47
  188 16 16
  194 20 20
  195 55 55
  196 35 35
  197 12 12
  198 999 999
  199 110 110
  200 74 74
  201 24 24
  207 16 16
  208 20 20
  209 12 12
  211 51 51
  212 266 266
  213 407 407
  214 78 78
  215 63 63
  220 16 16
  221 12 12
  222 110 110
  223 47 47
  224 35 35
  225 20 20
  226 27 27
  227 47 47
  228 27 27
  229 20 20
  239 47 47
  240 35 35
  241 31 31
  242 16 16
  248 16 16
  250 12 12
  254 31 31
  256 262 262
  257 35 35
  258 12 12
  282 82 82
  283 12 12
  313 12 12