ACCESSION: MSBNK-Waters-WA002300
RECORD_TITLE: Debrisoquin; LC-ESI-Q; MS; POS; 30 V
DATE: 2016.01.19 (Created 2007.08.01, modified 2011.05.06)
AUTHORS: Nihon Waters K.K.
LICENSE: CC BY-NC

CH$NAME: Debrisoquin
CH$COMPOUND_CLASS: N/A
CH$FORMULA: C10H13N3
CH$EXACT_MASS: 175.11095
CH$SMILES: NC(=N)N(C1)Cc(c2)c(ccc2)C1
CH$IUPAC: InChI=1S/C10H13N3/c11-10(12)13-6-5-8-3-1-2-4-9(8)7-13/h1-4H,5-7H2,(H3,11,12)
CH$LINK: CAS 1131-64-2
CH$LINK: INCHIKEY JWPGJSVJDAJRLW-UHFFFAOYSA-N
CH$LINK: COMPTOX DTXSID7022885

AC$INSTRUMENT: ZQ, Waters
AC$INSTRUMENT_TYPE: LC-ESI-Q
AC$MASS_SPECTROMETRY: MS_TYPE MS
AC$MASS_SPECTROMETRY: ION_MODE POSITIVE
AC$MASS_SPECTROMETRY: IONIZATION ESI
AC$CHROMATOGRAPHY: RETENTION_TIME 10.390 min
AC$CHROMATOGRAPHY: COLUMN_NAME 2.1 mm id - 3. 5{mu}m XTerra C18MS
AC$CHROMATOGRAPHY: COLUMN_TEMPERATURE 35 C
AC$CHROMATOGRAPHY: SAMPLING_CONE 30 V

MS$DATA_PROCESSING: FIND_PEAK ignore rel.int. < 5

PK$SPLASH: splash10-0059-0900000000-7abe252d02110d8913af
PK$NUM_PEAK: 10
PK$PEAK: m/z int. rel.int.
  105 16 16
  117 16 16
  134 768 768
  135 71 71
  142 12 12
  159 133 133
  160 16 16
  176 999 999
  177 196 196
  178 12 12