ACCESSION: MSBNK-Waters-WA002422
RECORD_TITLE: Vincamine; LC-ESI-Q; MS; POS; 90 V
DATE: 2016.01.19 (Created 2007.08.01, modified 2011.05.06)
AUTHORS: Nihon Waters K.K.
LICENSE: CC BY-NC

CH$NAME: Vincamine
CH$COMPOUND_CLASS: N/A
CH$FORMULA: C21H26N2O3
CH$EXACT_MASS: 354.19434
CH$SMILES: COC(=O)C(O)(C1)n(c54)c(c3c(cccc5)4)C([H])(N2CC3)C(CC)(CCC2)1
CH$IUPAC: InChI=1S/C21H26N2O3/c1-3-20-10-6-11-22-12-9-15-14-7-4-5-8-16(14)23(17(15)18(20)22)21(25,13-20)19(24)26-2/h4-5,7-8,18,25H,3,6,9-13H2,1-2H3/t18-,20+,21+/m1/s1
CH$LINK: CAS 1617-90-9
CH$LINK: INCHIKEY RXPRRQLKFXBCSJ-GIVPXCGWSA-N
CH$LINK: COMPTOX DTXSID9040134

AC$INSTRUMENT: ZQ, Waters
AC$INSTRUMENT_TYPE: LC-ESI-Q
AC$MASS_SPECTROMETRY: MS_TYPE MS
AC$MASS_SPECTROMETRY: ION_MODE POSITIVE
AC$MASS_SPECTROMETRY: IONIZATION ESI
AC$CHROMATOGRAPHY: RETENTION_TIME 13.000 min
AC$CHROMATOGRAPHY: COLUMN_NAME 2.1 mm id - 3. 5{mu}m XTerra C18MS
AC$CHROMATOGRAPHY: COLUMN_TEMPERATURE 35 C
AC$CHROMATOGRAPHY: SAMPLING_CONE 90 V

MS$DATA_PROCESSING: FIND_PEAK ignore rel.int. < 5

PK$SPLASH: splash10-00kf-0790000000-84487fda303f6cbcfec9
PK$NUM_PEAK: 133
PK$PEAK: m/z int. rel.int.
  103 24 24
  105 157 157
  106 47 47
  107 118 118
  108 82 82
  109 67 67
  110 274 274
  111 47 47
  112 43 43
  115 51 51
  117 168 168
  118 59 59
  119 31 31
  120 63 63
  121 35 35
  122 71 71
  123 118 118
  124 294 294
  125 24 24
  128 24 24
  129 51 51
  130 125 125
  131 47 47
  132 59 59
  133 35 35
  134 118 118
  135 51 51
  136 39 39
  138 12 12
  142 12 12
  143 59 59
  144 999 999
  145 118 118
  146 39 39
  148 24 24
  150 16 16
  151 16 16
  152 172 172
  153 27 27
  154 27 27
  155 16 16
  156 74 74
  157 35 35
  158 47 47
  160 12 12
  162 27 27
  164 12 12
  165 12 12
  167 27 27
  168 71 71
  169 31 31
  170 63 63
  171 16 16
  172 27 27
  178 16 16
  179 12 12
  180 63 63
  181 71 71
  182 67 67
  183 27 27
  184 31 31
  191 24 24
  192 31 31
  193 59 59
  194 102 102
  195 39 39
  196 43 43
  197 20 20
  198 24 24
  204 35 35
  205 51 51
  206 98 98
  207 74 74
  208 137 137
  209 78 78
  210 43 43
  211 16 16
  212 47 47
  217 16 16
  218 31 31
  219 74 74
  220 180 180
  221 78 78
  222 125 125
  223 47 47
  224 78 78
  225 20 20
  226 27 27
  232 27 27
  233 27 27
  234 125 125
  235 59 59
  236 67 67
  237 63 63
  238 90 90
  239 102 102
  240 24 24
  247 27 27
  248 90 90
  249 78 78
  250 63 63
  251 98 98
  252 149 149
  253 90 90
  254 24 24
  262 24 24
  263 39 39
  264 212 212
  265 341 341
  266 439 439
  267 325 325
  268 141 141
  269 16 16
  276 20 20
  277 39 39
  278 137 137
  279 192 192
  280 572 572
  281 121 121
  282 24 24
  290 20 20
  291 16 16
  292 90 90
  293 82 82
  294 247 247
  295 67 67
  306 20 20
  307 59 59
  308 121 121
  309 27 27
  337 59 59
  338 16 16
  355 27 27