ACCESSION: MSBNK-Waters-WA002427
RECORD_TITLE: Vincamone; LC-ESI-Q; MS; POS; 90 V
DATE: 2016.01.19 (Created 2007.08.01, modified 2011.05.06)
AUTHORS: Nihon Waters K.K.
LICENSE: CC BY-NC

CH$NAME: Vincamone
CH$COMPOUND_CLASS: N/A
CH$FORMULA: C19H22N2O
CH$EXACT_MASS: 294.17321
CH$SMILES: CCC(C5)(C3)C([H])(N(CC5)4)c(c(CC4)1)n(C(=O)3)c(c2)c(ccc2)1
CH$IUPAC: InChI=1S/C19H22N2O/c1-2-19-9-5-10-20-11-8-14-13-6-3-4-7-15(13)21(16(22)12-19)17(14)18(19)20/h3-4,6-7,18H,2,5,8-12H2,1H3/t18-,19+/m1/s1
CH$LINK: CAS 4880-88-0
CH$LINK: INCHIKEY WYJAPUKIYAZSEM-MOPGFXCFSA-N
CH$LINK: COMPTOX DTXSID6045119

AC$INSTRUMENT: ZQ, Waters
AC$INSTRUMENT_TYPE: LC-ESI-Q
AC$MASS_SPECTROMETRY: MS_TYPE MS
AC$MASS_SPECTROMETRY: ION_MODE POSITIVE
AC$MASS_SPECTROMETRY: IONIZATION ESI
AC$CHROMATOGRAPHY: RETENTION_TIME 13.600 min
AC$CHROMATOGRAPHY: COLUMN_NAME 2.1 mm id - 3. 5{mu}m XTerra C18MS
AC$CHROMATOGRAPHY: COLUMN_TEMPERATURE 35 C
AC$CHROMATOGRAPHY: SAMPLING_CONE 90 V

MS$DATA_PROCESSING: FIND_PEAK ignore rel.int. < 5

PK$SPLASH: splash10-00di-0960000000-cb6d3a8456b37347a63d
PK$NUM_PEAK: 109
PK$PEAK: m/z int. rel.int.
  103 43 43
  105 219 219
  106 110 110
  107 251 251
  108 165 165
  109 149 149
  110 141 141
  111 82 82
  112 39 39
  115 145 145
  116 24 24
  117 259 259
  118 219 219
  119 102 102
  120 63 63
  121 47 47
  122 137 137
  123 82 82
  124 306 306
  125 20 20
  128 74 74
  129 184 184
  130 501 501
  131 196 196
  132 227 227
  133 55 55
  134 78 78
  135 35 35
  136 35 35
  138 24 24
  141 20 20
  142 47 47
  143 168 168
  144 995 995
  145 94 94
  146 67 67
  147 12 12
  150 43 43
  152 59 59
  154 157 157
  155 125 125
  156 204 204
  157 98 98
  158 145 145
  159 12 12
  160 16 16
  164 12 12
  165 20 20
  167 396 396
  168 787 787
  169 294 294
  170 247 247
  171 31 31
  172 55 55
  179 12 12
  180 498 498
  181 513 513
  182 580 580
  183 192 192
  184 227 227
  185 27 27
  186 12 12
  192 35 35
  193 82 82
  194 490 490
  195 415 415
  196 768 768
  197 603 603
  198 219 219
  199 35 35
  204 24 24
  205 20 20
  206 118 118
  207 133 133
  208 451 451
  209 415 415
  210 850 850
  211 270 270
  212 110 110
  213 16 16
  218 12 12
  219 16 16
  220 133 133
  221 102 102
  222 764 764
  223 991 991
  224 999 999
  225 631 631
  226 200 200
  227 20 20
  234 118 118
  235 114 114
  236 439 439
  237 466 466
  238 642 642
  239 94 94
  248 55 55
  249 94 94
  250 67 67
  251 71 71
  252 172 172
  253 35 35
  263 31 31
  264 51 51
  265 24 24
  266 67 67
  267 20 20
  295 106 106
  296 12 12