ACCESSION: MSBNK-Waters-WA002430
RECORD_TITLE: Vincamone; LC-ESI-Q; MS; POS; 45 V
DATE: 2016.01.19 (Created 2007.08.01, modified 2011.05.06)
AUTHORS: Nihon Waters K.K.
LICENSE: CC BY-NC

CH$NAME: Vincamone
CH$COMPOUND_CLASS: N/A
CH$FORMULA: C19H22N2O
CH$EXACT_MASS: 294.17321
CH$SMILES: CCC(C5)(C3)C([H])(N(CC5)4)c(c(CC4)1)n(C(=O)3)c(c2)c(ccc2)1
CH$IUPAC: InChI=1S/C19H22N2O/c1-2-19-9-5-10-20-11-8-14-13-6-3-4-7-15(13)21(16(22)12-19)17(14)18(19)20/h3-4,6-7,18H,2,5,8-12H2,1H3/t18-,19+/m1/s1
CH$LINK: CAS 4880-88-0
CH$LINK: INCHIKEY WYJAPUKIYAZSEM-MOPGFXCFSA-N
CH$LINK: COMPTOX DTXSID6045119

AC$INSTRUMENT: ZQ, Waters
AC$INSTRUMENT_TYPE: LC-ESI-Q
AC$MASS_SPECTROMETRY: MS_TYPE MS
AC$MASS_SPECTROMETRY: ION_MODE POSITIVE
AC$MASS_SPECTROMETRY: IONIZATION ESI
AC$CHROMATOGRAPHY: RETENTION_TIME 13.200 min
AC$CHROMATOGRAPHY: COLUMN_NAME 2.1 mm id - 3. 5{mu}m XTerra C18MS
AC$CHROMATOGRAPHY: COLUMN_TEMPERATURE 35 C
AC$CHROMATOGRAPHY: SAMPLING_CONE 45 V

MS$DATA_PROCESSING: FIND_PEAK ignore rel.int. < 5

PK$SPLASH: splash10-0002-0090000000-dcb5be82219e2c275287
PK$NUM_PEAK: 15
PK$PEAK: m/z int. rel.int.
  144 20 20
  152 20 20
  226 24 24
  238 63 63
  239 12 12
  252 16 16
  253 43 43
  264 24 24
  266 98 98
  267 20 20
  278 12 12
  293 31 31
  295 999 999
  296 212 212
  297 24 24