ACCESSION: MSBNK-Waters-WA002437
RECORD_TITLE: Triprolidine; LC-ESI-Q; MS; POS; 90 V
DATE: 2016.01.19 (Created 2007.08.01, modified 2011.05.06)
AUTHORS: Nihon Waters K.K.
LICENSE: CC BY-NC

CH$NAME: Triprolidine
CH$COMPOUND_CLASS: N/A
CH$FORMULA: C19H22N2
CH$EXACT_MASS: 278.17830
CH$SMILES: Cc(c3)ccc(c3)C(=C([H])CN(C2)CCC2)c(c1)nccc1
CH$IUPAC: InChI=1S/C19H22N2/c1-16-7-9-17(10-8-16)18(19-6-2-3-12-20-19)11-15-21-13-4-5-14-21/h2-3,6-12H,4-5,13-15H2,1H3/b18-11+
CH$LINK: CAS 486-12-4
CH$LINK: INCHIKEY CBEQULMOCCWAQT-WOJGMQOQSA-N
CH$LINK: COMPTOX DTXSID3023718

AC$INSTRUMENT: ZQ, Waters
AC$INSTRUMENT_TYPE: LC-ESI-Q
AC$MASS_SPECTROMETRY: MS_TYPE MS
AC$MASS_SPECTROMETRY: ION_MODE POSITIVE
AC$MASS_SPECTROMETRY: IONIZATION ESI
AC$CHROMATOGRAPHY: RETENTION_TIME 13.580 min
AC$CHROMATOGRAPHY: COLUMN_NAME 2.1 mm id - 3. 5{mu}m XTerra C18MS
AC$CHROMATOGRAPHY: COLUMN_TEMPERATURE 35 C
AC$CHROMATOGRAPHY: SAMPLING_CONE 90 V

MS$DATA_PROCESSING: FIND_PEAK ignore rel.int. < 5

PK$SPLASH: splash10-0006-0910000000-36813944f5dbb06b8dce
PK$NUM_PEAK: 31
PK$PEAK: m/z int. rel.int.
  103 20 20
  105 51 51
  115 204 204
  116 43 43
  117 141 141
  118 12 12
  127 12 12
  128 67 67
  129 35 35
  130 12 12
  140 12 12
  141 12 12
  152 20 20
  165 188 188
  166 67 67
  167 396 396
  168 47 47
  178 24 24
  179 12 12
  180 180 180
  181 102 102
  182 16 16
  191 302 302
  192 999 999
  193 932 932
  194 114 114
  204 47 47
  205 20 20
  206 317 317
  207 176 176
  208 78 78