ACCESSION: MSBNK-Waters-WA002450
RECORD_TITLE: Pyrimethamine; LC-ESI-Q; MS; POS; 75 V
DATE: 2016.01.19 (Created 2007.08.01, modified 2011.05.06)
AUTHORS: Nihon Waters K.K.
LICENSE: CC BY-NC

CH$NAME: Pyrimethamine
CH$COMPOUND_CLASS: N/A
CH$FORMULA: C12H13ClN4
CH$EXACT_MASS: 248.08287
CH$SMILES: CCc(n2)c(c(N)nc(N)2)c(c1)ccc(Cl)c1
CH$IUPAC: InChI=1S/C12H13ClN4/c1-2-9-10(11(14)17-12(15)16-9)7-3-5-8(13)6-4-7/h3-6H,2H2,1H3,(H4,14,15,16,17)
CH$LINK: CAS 58-14-0
CH$LINK: INCHIKEY WKSAUQYGYAYLPV-UHFFFAOYSA-N
CH$LINK: COMPTOX DTXSID9021217

AC$INSTRUMENT: ZQ, Waters
AC$INSTRUMENT_TYPE: LC-ESI-Q
AC$MASS_SPECTROMETRY: MS_TYPE MS
AC$MASS_SPECTROMETRY: ION_MODE POSITIVE
AC$MASS_SPECTROMETRY: IONIZATION ESI
AC$CHROMATOGRAPHY: RETENTION_TIME 12.850 min
AC$CHROMATOGRAPHY: COLUMN_NAME 2.1 mm id - 3. 5{mu}m XTerra C18MS
AC$CHROMATOGRAPHY: COLUMN_TEMPERATURE 35 C
AC$CHROMATOGRAPHY: SAMPLING_CONE 75 V

MS$DATA_PROCESSING: FIND_PEAK ignore rel.int. < 5

PK$SPLASH: splash10-0059-0930000000-0d10a97577f865ee421e
PK$NUM_PEAK: 68
PK$PEAK: m/z int. rel.int.
  111 20 20
  113 24 24
  115 106 106
  116 31 31
  117 168 168
  125 118 118
  127 176 176
  128 619 619
  129 86 86
  130 74 74
  137 12 12
  139 39 39
  140 31 31
  141 16 16
  142 31 31
  143 31 31
  144 20 20
  145 94 94
  149 35 35
  150 43 43
  151 20 20
  152 149 149
  153 31 31
  154 208 208
  155 419 419
  156 78 78
  157 16 16
  162 12 12
  163 302 302
  164 43 43
  165 125 125
  166 16 16
  169 16 16
  170 20 20
  171 16 16
  172 20 20
  177 968 968
  178 94 94
  179 333 333
  180 78 78
  181 16 16
  182 24 24
  188 20 20
  189 12 12
  190 78 78
  191 47 47
  192 55 55
  193 12 12
  194 16 16
  196 59 59
  197 74 74
  198 435 435
  199 71 71
  207 90 90
  208 12 12
  209 27 27
  213 55 55
  215 16 16
  216 20 20
  217 20 20
  233 999 999
  234 157 157
  235 337 337
  236 47 47
  249 364 364
  250 59 59
  251 129 129
  252 20 20