ACCESSION: MSBNK-Waters-WA002502
RECORD_TITLE: Tolbutamide; LC-ESI-Q; MS; POS; 60 V
DATE: 2016.01.19 (Created 2007.08.01, modified 2011.05.06)
AUTHORS: Nihon Waters K.K.
LICENSE: CC BY-NC

CH$NAME: Tolbutamide
CH$COMPOUND_CLASS: N/A
CH$FORMULA: C12H18N2O3S
CH$EXACT_MASS: 270.10381
CH$SMILES: CCCCNC(=O)NS(=O)(=O)c(c1)ccc(C)c1
CH$IUPAC: InChI=1S/C12H18N2O3S/c1-3-4-9-13-12(15)14-18(16,17)11-7-5-10(2)6-8-11/h5-8H,3-4,9H2,1-2H3,(H2,13,14,15)
CH$LINK: CAS 64-77-7
CH$LINK: INCHIKEY JLRGJRBPOGGCBT-UHFFFAOYSA-N
CH$LINK: COMPTOX DTXSID8021359

AC$INSTRUMENT: ZQ, Waters
AC$INSTRUMENT_TYPE: LC-ESI-Q
AC$MASS_SPECTROMETRY: MS_TYPE MS
AC$MASS_SPECTROMETRY: ION_MODE POSITIVE
AC$MASS_SPECTROMETRY: IONIZATION ESI
AC$CHROMATOGRAPHY: RETENTION_TIME 16.100 min
AC$CHROMATOGRAPHY: COLUMN_NAME 2.1 mm id - 3. 5{mu}m XTerra C18MS
AC$CHROMATOGRAPHY: COLUMN_TEMPERATURE 35 C
AC$CHROMATOGRAPHY: SAMPLING_CONE 60 V

MS$DATA_PROCESSING: FIND_PEAK ignore rel.int. < 5

PK$SPLASH: splash10-0aou-0951000000-40ad9892e825a0eb12ae
PK$NUM_PEAK: 79
PK$PEAK: m/z int. rel.int.
  104 55 55
  106 39 39
  108 16 16
  109 537 537
  110 31 31
  111 31 31
  114 16 16
  119 999 999
  120 43 43
  122 298 298
  126 12 12
  127 12 12
  129 31 31
  132 521 521
  133 39 39
  139 20 20
  144 12 12
  149 24 24
  155 913 913
  156 59 59
  157 47 47
  163 20 20
  170 16 16
  172 204 204
  173 16 16
  174 12 12
  175 27 27
  178 55 55
  182 16 16
  183 110 110
  184 27 27
  191 16 16
  194 39 39
  197 16 16
  204 31 31
  205 16 16
  206 12 12
  210 43 43
  211 35 35
  212 12 12
  213 12 12
  217 86 86
  219 20 20
  220 12 12
  221 31 31
  222 16 16
  224 12 12
  227 16 16
  229 20 20
  233 59 59
  235 16 16
  238 12 12
  240 725 725
  241 129 129
  249 47 47
  251 12 12
  252 24 24
  258 12 12
  261 16 16
  264 16 16
  267 12 12
  271 153 153
  272 24 24
  273 12 12
  274 27 27
  277 63 63
  278 20 20
  281 12 12
  287 16 16
  290 12 12
  293 584 584
  294 74 74
  295 43 43
  299 24 24
  307 31 31
  309 505 505
  310 74 74
  311 78 78
  312 12 12