ACCESSION: MSBNK-Waters-WA002527
RECORD_TITLE: Prilocaine; LC-ESI-Q; MS; POS; 75 V
DATE: 2016.01.19 (Created 2007.08.01, modified 2011.05.06)
AUTHORS: Nihon Waters K.K.
LICENSE: CC BY-NC

CH$NAME: Prilocaine
CH$COMPOUND_CLASS: N/A
CH$FORMULA: C13H20N2O
CH$EXACT_MASS: 220.15756
CH$SMILES: CCCNC(C)C(=O)Nc(c1)c(C)ccc1
CH$IUPAC: InChI=1S/C13H20N2O/c1-4-9-14-11(3)13(16)15-12-8-6-5-7-10(12)2/h5-8,11,14H,4,9H2,1-3H3,(H,15,16)
CH$LINK: CAS 721-50-6
CH$LINK: INCHIKEY MVFGUOIZUNYYSO-UHFFFAOYSA-N
CH$LINK: COMPTOX DTXSID7031955

AC$INSTRUMENT: ZQ, Waters
AC$INSTRUMENT_TYPE: LC-ESI-Q
AC$MASS_SPECTROMETRY: MS_TYPE MS
AC$MASS_SPECTROMETRY: ION_MODE POSITIVE
AC$MASS_SPECTROMETRY: IONIZATION ESI
AC$CHROMATOGRAPHY: RETENTION_TIME 11.430 min
AC$CHROMATOGRAPHY: COLUMN_NAME 2.1 mm id - 3. 5{mu}m XTerra C18MS
AC$CHROMATOGRAPHY: COLUMN_TEMPERATURE 35 C
AC$CHROMATOGRAPHY: SAMPLING_CONE 75 V

MS$DATA_PROCESSING: FIND_PEAK ignore rel.int. < 5

PK$SPLASH: splash10-0aor-0910000000-ebd43822752be729d4f7
PK$NUM_PEAK: 70
PK$PEAK: m/z int. rel.int.
  101 51 51
  102 16 16
  104 129 129
  105 43 43
  106 423 423
  107 247 247
  108 928 928
  109 936 936
  110 71 71
  111 47 47
  113 102 102
  117 161 161
  118 999 999
  119 713 713
  120 63 63
  124 47 47
  127 74 74
  128 24 24
  129 31 31
  130 71 71
  132 705 705
  133 63 63
  134 286 286
  136 262 262
  137 20 20
  141 16 16
  144 196 196
  146 157 157
  147 51 51
  150 35 35
  151 55 55
  152 24 24
  155 27 27
  159 208 208
  161 43 43
  167 43 43
  168 12 12
  170 12 12
  171 55 55
  176 43 43
  177 82 82
  178 86 86
  182 31 31
  183 82 82
  184 20 20
  186 24 24
  187 51 51
  188 24 24
  189 43 43
  191 16 16
  192 27 27
  193 24 24
  194 74 74
  196 71 71
  198 39 39
  201 51 51
  203 24 24
  204 16 16
  205 24 24
  209 71 71
  210 94 94
  213 31 31
  214 27 27
  221 454 454
  222 55 55
  223 20 20
  227 20 20
  228 12 12
  229 12 12
  231 20 20