ACCESSION: MSBNK-Waters-WA002561
RECORD_TITLE: Nitrendipine; LC-ESI-Q; MS; POS; 15 V
DATE: 2016.01.19 (Created 2007.08.01, modified 2011.05.06)
AUTHORS: Nihon Waters K.K.
LICENSE: CC BY-NC

CH$NAME: Nitrendipine
CH$COMPOUND_CLASS: N/A
CH$FORMULA: C18H20N2O6
CH$EXACT_MASS: 360.13214
CH$SMILES: CCOC(=O)C(=C(C)1)C(c(c2)cc(N(=O)=O)cc2)C(C(=O)OC)=C(C)N1
CH$IUPAC: InChI=1S/C18H20N2O6/c1-5-26-18(22)15-11(3)19-10(2)14(17(21)25-4)16(15)12-7-6-8-13(9-12)20(23)24/h6-9,16,19H,5H2,1-4H3
CH$LINK: CAS 39562-70-4
CH$LINK: INCHIKEY PVHUJELLJLJGLN-UHFFFAOYSA-N
CH$LINK: COMPTOX DTXSID0023373

AC$INSTRUMENT: ZQ, Waters
AC$INSTRUMENT_TYPE: LC-ESI-Q
AC$MASS_SPECTROMETRY: MS_TYPE MS
AC$MASS_SPECTROMETRY: ION_MODE POSITIVE
AC$MASS_SPECTROMETRY: IONIZATION ESI
AC$CHROMATOGRAPHY: RETENTION_TIME 18.180 min
AC$CHROMATOGRAPHY: COLUMN_NAME 2.1 mm id - 3. 5{mu}m XTerra C18MS
AC$CHROMATOGRAPHY: COLUMN_TEMPERATURE 35 C
AC$CHROMATOGRAPHY: SAMPLING_CONE 15 V

MS$DATA_PROCESSING: FIND_PEAK ignore rel.int. < 5

PK$SPLASH: splash10-0400-0009000000-ef3c3500d7eb1f9216ff
PK$NUM_PEAK: 20
PK$PEAK: m/z int. rel.int.
  122 35 35
  193 12 12
  209 16 16
  288 47 47
  315 627 627
  316 74 74
  317 12 12
  329 282 282
  330 43 43
  343 12 12
  359 35 35
  361 999 999
  362 168 168
  363 24 24
  371 20 20
  377 74 74
  378 435 435
  379 78 78
  380 12 12
  383 31 31