ACCESSION: MSBNK-Waters-WA002609
RECORD_TITLE: Dihydralazine; LC-ESI-Q; MS; POS; 45 V
DATE: 2016.01.19 (Created 2007.08.01, modified 2011.05.06)
AUTHORS: Nihon Waters K.K.
LICENSE: CC BY-NC

CH$NAME: Dihydralazine
CH$COMPOUND_CLASS: N/A
CH$FORMULA: C8H10N6
CH$EXACT_MASS: 190.09669
CH$SMILES: NNc(n1)c(c2)c(ccc2)c(NN)n1
CH$IUPAC: InChI=1S/C8H10N6/c9-11-7-5-3-1-2-4-6(5)8(12-10)14-13-7/h1-4H,9-10H2,(H,11,13)(H,12,14)
CH$LINK: CAS 484-23-1
CH$LINK: INCHIKEY VQKLRVZQQYVIJW-UHFFFAOYSA-N
CH$LINK: COMPTOX DTXSID0022935

AC$INSTRUMENT: ZQ, Waters
AC$INSTRUMENT_TYPE: LC-ESI-Q
AC$MASS_SPECTROMETRY: MS_TYPE MS
AC$MASS_SPECTROMETRY: ION_MODE POSITIVE
AC$MASS_SPECTROMETRY: IONIZATION ESI
AC$CHROMATOGRAPHY: RETENTION_TIME 2.370 min
AC$CHROMATOGRAPHY: COLUMN_NAME 2.1 mm id - 3. 5{mu}m XTerra C18MS
AC$CHROMATOGRAPHY: COLUMN_TEMPERATURE 35 C
AC$CHROMATOGRAPHY: SAMPLING_CONE 45 V

MS$DATA_PROCESSING: FIND_PEAK ignore rel.int. < 5

PK$SPLASH: splash10-004i-0900000000-70e67f1fc4a81805eaa2
PK$NUM_PEAK: 18
PK$PEAK: m/z int. rel.int.
  81 12 12
  89 12 12
  91 20 20
  92 31 31
  102 125 125
  103 47 47
  117 24 24
  118 16 16
  120 78 78
  129 999 999
  130 208 208
  131 16 16
  145 20 20
  146 16 16
  147 27 27
  170 12 12
  174 24 24
  175 12 12