ACCESSION: MSBNK-Waters-WA002613
RECORD_TITLE: Ouabain; LC-ESI-Q; MS; POS; 60 V
DATE: 2016.01.19 (Created 2007.08.01, modified 2011.05.06)
AUTHORS: Nihon Waters K.K.
LICENSE: CC BY-NC

CH$NAME: Ouabain
CH$COMPOUND_CLASS: N/A
CH$FORMULA: C29H44O12
CH$EXACT_MASS: 584.28328
CH$SMILES: C(C2(O)3)CC(C2(CC(O)C([H])(C(CO)46)C3(CCC(CC(CC6O)OC(O5)C(O)C(O)C(C(C)5)O)4O)[H])C)C(C1)=CC(=O)O1
CH$IUPAC: InChI=1S/C29H44O12/c1-13-22(34)23(35)24(36)25(40-13)41-15-8-19(32)28(12-30)21-17(3-5-27(28,37)9-15)29(38)6-4-16(14-7-20(33)39-11-14)26(29,2)10-18(21)31/h7,13,15-19,21-25,30-32,34-38H,3-6,8-12H2,1-2H3/t13-,15-,16+,17+,18+,19+,21+,22+,23+,24+,25-,26+,27-,28+,29-/m0/s1
CH$LINK: CAS 630-60-4
CH$LINK: INCHIKEY LPMXVESGRSUGHW-PUBTVXBGSA-N

AC$INSTRUMENT: ZQ, Waters
AC$INSTRUMENT_TYPE: LC-ESI-Q
AC$MASS_SPECTROMETRY: MS_TYPE MS
AC$MASS_SPECTROMETRY: ION_MODE POSITIVE
AC$MASS_SPECTROMETRY: IONIZATION ESI
AC$CHROMATOGRAPHY: RETENTION_TIME 10.740 min
AC$CHROMATOGRAPHY: COLUMN_NAME 2.1 mm id - 3. 5{mu}m XTerra C18MS
AC$CHROMATOGRAPHY: COLUMN_TEMPERATURE 35 C
AC$CHROMATOGRAPHY: SAMPLING_CONE 60 V

MS$DATA_PROCESSING: FIND_PEAK ignore rel.int. < 5

PK$SPLASH: splash10-0ab9-0924102000-44bced3cb585db8d8d8c
PK$NUM_PEAK: 175
PK$PEAK: m/z int. rel.int.
  102 20 20
  104 82 82
  105 78 78
  106 35 35
  107 157 157
  110 31 31
  111 157 157
  112 27 27
  117 247 247
  119 114 114
  121 27 27
  122 878 878
  123 74 74
  124 20 20
  125 208 208
  126 16 16
  129 372 372
  130 31 31
  131 270 270
  133 78 78
  134 59 59
  135 35 35
  137 31 31
  138 12 12
  141 286 286
  143 337 337
  144 24 24
  145 243 243
  146 43 43
  147 74 74
  149 43 43
  150 12 12
  153 59 59
  155 165 165
  157 999 999
  158 63 63
  159 317 317
  160 39 39
  161 125 125
  163 110 110
  165 20 20
  167 43 43
  169 176 176
  170 20 20
  171 102 102
  173 20 20
  175 39 39
  177 102 102
  179 59 59
  180 16 16
  181 137 137
  182 16 16
  183 67 67
  185 106 106
  186 16 16
  187 98 98
  188 12 12
  189 102 102
  191 43 43
  192 20 20
  193 67 67
  194 24 24
  195 98 98
  197 47 47
  198 20 20
  199 59 59
  205 27 27
  206 12 12
  207 121 121
  208 27 27
  209 59 59
  211 35 35
  213 55 55
  215 20 20
  216 12 12
  217 24 24
  219 16 16
  220 12 12
  221 110 110
  223 43 43
  225 39 39
  227 39 39
  231 24 24
  233 39 39
  235 78 78
  237 16 16
  238 20 20
  239 51 51
  241 31 31
  243 20 20
  245 20 20
  247 24 24
  249 39 39
  255 16 16
  259 59 59
  260 47 47
  261 47 47
  263 59 59
  267 12 12
  271 12 12
  273 90 90
  274 12 12
  275 16 16
  277 67 67
  279 24 24
  281 47 47
  285 35 35
  287 12 12
  291 67 67
  292 20 20
  293 43 43
  295 24 24
  296 20 20
  301 27 27
  303 35 35
  305 47 47
  309 35 35
  313 12 12
  315 12 12
  319 298 298
  320 59 59
  321 129 129
  323 94 94
  324 12 12
  325 16 16
  331 94 94
  332 16 16
  337 337 337
  338 63 63
  339 78 78
  340 20 20
  341 47 47
  349 451 451
  350 63 63
  351 24 24
  353 12 12
  355 631 631
  356 90 90
  357 59 59
  367 407 407
  368 114 114
  369 71 71
  373 215 215
  374 20 20
  385 353 353
  386 59 59
  403 376 376
  404 59 59
  413 12 12
  421 102 102
  422 20 20
  439 184 184
  440 43 43
  444 12 12
  465 16 16
  487 12 12
  495 20 20
  513 27 27
  549 16 16
  550 12 12
  552 12 12
  553 16 16
  567 39 39
  569 12 12
  585 349 349
  586 94 94
  591 12 12
  604 12 12
  607 607 607
  608 157 157
  609 12 12
  613 12 12
  623 709 709
  624 137 137
  625 82 82