ACCESSION: MSBNK-Waters-WA002722
RECORD_TITLE: Isocarboxazid; LC-ESI-Q; MS; POS; 15 V
DATE: 2016.01.19 (Created 2007.08.01, modified 2011.05.06)
AUTHORS: Nihon Waters K.K.
LICENSE: CC BY-NC

CH$NAME: Isocarboxazid
CH$COMPOUND_CLASS: N/A
CH$FORMULA: C12H13N3O2
CH$EXACT_MASS: 231.10078
CH$SMILES: Cc(o2)cc(n2)C(=O)NNCc(c1)cccc1
CH$IUPAC: InChI=1S/C12H13N3O2/c1-9-7-11(15-17-9)12(16)14-13-8-10-5-3-2-4-6-10/h2-7,13H,8H2,1H3,(H,14,16)
CH$LINK: CAS 59-63-2
CH$LINK: INCHIKEY XKFPYPQQHFEXRZ-UHFFFAOYSA-N
CH$LINK: COMPTOX DTXSID4023171

AC$INSTRUMENT: ZQ, Waters
AC$INSTRUMENT_TYPE: LC-ESI-Q
AC$MASS_SPECTROMETRY: MS_TYPE MS
AC$MASS_SPECTROMETRY: ION_MODE POSITIVE
AC$MASS_SPECTROMETRY: IONIZATION ESI
AC$CHROMATOGRAPHY: RETENTION_TIME 14.380 min
AC$CHROMATOGRAPHY: COLUMN_NAME 2.1 mm id - 3. 5{mu}m XTerra C18MS
AC$CHROMATOGRAPHY: COLUMN_TEMPERATURE 35 C
AC$CHROMATOGRAPHY: SAMPLING_CONE 15 V

MS$DATA_PROCESSING: FIND_PEAK ignore rel.int. < 5

PK$SPLASH: splash10-001i-0090000000-06cb1aa4698936a4e610
PK$NUM_PEAK: 6
PK$PEAK: m/z int. rel.int.
  132 8 8
  232 999 999
  233 118 118
  234 8 8
  254 31 31
  270 8 8