ACCESSION: MSBNK-Waters-WA002776
RECORD_TITLE: Thioguanine; LC-ESI-Q; MS; NEG; 30 V
DATE: 2016.01.19 (Created 2007.08.01, modified 2011.05.06)
AUTHORS: Nihon Waters K.K.
LICENSE: CC BY-NC

CH$NAME: Thioguanine
CH$COMPOUND_CLASS: N/A
CH$FORMULA: C5H5N5S
CH$EXACT_MASS: 167.02657
CH$SMILES: C1=NC2=C(N1)C(=S)N=C(N2)N
CH$IUPAC: InChI=1S/C5H5N5S/c6-5-9-3-2(4(11)10-5)7-1-8-3/h1H,(H4,6,7,8,9,10,11)
CH$LINK: CAS 154-42-7
CH$LINK: INCHIKEY WYWHKKSPHMUBEB-UHFFFAOYSA-N
CH$LINK: COMPTOX DTXSID6023652

AC$INSTRUMENT: ZQ, Waters
AC$INSTRUMENT_TYPE: LC-ESI-Q
AC$MASS_SPECTROMETRY: MS_TYPE MS
AC$MASS_SPECTROMETRY: ION_MODE NEGATIVE
AC$MASS_SPECTROMETRY: IONIZATION ESI
AC$CHROMATOGRAPHY: RETENTION_TIME 2.830 min
AC$CHROMATOGRAPHY: COLUMN_NAME 2.1 mm id - 3. 5{mu}m XTerra C18MS
AC$CHROMATOGRAPHY: COLUMN_TEMPERATURE 35 C
AC$CHROMATOGRAPHY: SAMPLING_CONE 30 V

MS$DATA_PROCESSING: FIND_PEAK ignore rel.int. < 5

PK$SPLASH: splash10-014i-0900000000-7da8812f553e7c1c0726
PK$NUM_PEAK: 19
PK$PEAK: m/z int. rel.int.
  107 24 24
  111 8 8
  117 12 12
  127 16 16
  131 8 8
  132 223 223
  133 20 20
  134 8 8
  137 24 24
  149 8 8
  150 16 16
  156 8 8
  166 999 999
  167 82 82
  168 35 35
  169 12 12
  171 20 20
  180 8 8
  182 67 67