ACCESSION: MSBNK-Waters-WA002797
RECORD_TITLE: Cyamemazine; LC-ESI-Q; MS; POS; 45 V
DATE: 2016.01.19 (Created 2007.08.01, modified 2011.05.06)
AUTHORS: Nihon Waters K.K.
LICENSE: CC BY-NC

CH$NAME: Cyamemazine
CH$COMPOUND_CLASS: N/A
CH$FORMULA: C19H21N3S
CH$EXACT_MASS: 323.14562
CH$SMILES: CN(C)CC(C)CN(c21)c(c3)c(ccc(C#N)3)Sc(cccc2)1
CH$IUPAC: InChI=1S/C19H21N3S/c1-14(12-21(2)3)13-22-16-6-4-5-7-18(16)23-19-9-8-15(11-20)10-17(19)22/h4-10,14H,12-13H2,1-3H3
CH$LINK: CAS 3546-03-0
CH$LINK: INCHIKEY SLFGIOIONGJGRT-UHFFFAOYSA-N

AC$INSTRUMENT: ZQ, Waters
AC$INSTRUMENT_TYPE: LC-ESI-Q
AC$MASS_SPECTROMETRY: MS_TYPE MS
AC$MASS_SPECTROMETRY: ION_MODE POSITIVE
AC$MASS_SPECTROMETRY: IONIZATION ESI
AC$CHROMATOGRAPHY: RETENTION_TIME 14.600 min
AC$CHROMATOGRAPHY: COLUMN_NAME 2.1 mm id - 3. 5{mu}m XTerra C18MS
AC$CHROMATOGRAPHY: COLUMN_TEMPERATURE 35 C
AC$CHROMATOGRAPHY: SAMPLING_CONE 45 V

MS$DATA_PROCESSING: FIND_PEAK ignore rel.int. < 5

PK$SPLASH: splash10-0uk9-0937000000-6f0460692e7b0434410b
PK$NUM_PEAK: 19
PK$PEAK: m/z int. rel.int.
  100 999 999
  101 78 78
  205 12 12
  223 8 8
  224 8 8
  237 200 200
  238 27 27
  239 12 12
  246 8 8
  279 63 63
  280 12 12
  295 16 16
  324 556 556
  325 110 110
  326 35 35
  340 78 78
  341 16 16
  356 59 59
  357 12 12