ACCESSION: MSBNK-Waters-WA002809
RECORD_TITLE: Desethylamiodarone; LC-ESI-Q; MS; POS; 15 V, 30 V
DATE: 2016.01.19 (Created 2007.08.01, modified 2011.05.06)
AUTHORS: Nihon Waters K.K.
LICENSE: CC BY-NC

CH$NAME: Desethylamiodarone
CH$COMPOUND_CLASS: N/A
CH$FORMULA: C23H25I2NO3
CH$EXACT_MASS: 616.99238
CH$SMILES: CCNCCOc(c(I)3)c(I)cc(c3)C(=O)c(c(CCCC)1)c(c2)c(ccc2)o1
CH$IUPAC: InChI=1S/C23H25I2NO3/c1-3-5-9-20-21(16-8-6-7-10-19(16)29-20)22(27)15-13-17(24)23(18(25)14-15)28-12-11-26-4-2/h6-8,10,13-14,26H,3-5,9,11-12H2,1-2H3
CH$LINK: CAS 83409-32-9
CH$LINK: INCHIKEY VXOKDLACQICQFA-UHFFFAOYSA-N
CH$LINK: COMPTOX DTXSID00232344

AC$INSTRUMENT: ZQ, Waters
AC$INSTRUMENT_TYPE: LC-ESI-Q
AC$MASS_SPECTROMETRY: MS_TYPE MS
AC$MASS_SPECTROMETRY: ION_MODE POSITIVE
AC$MASS_SPECTROMETRY: IONIZATION ESI
AC$CHROMATOGRAPHY: RETENTION_TIME 16.100 min
AC$CHROMATOGRAPHY: COLUMN_NAME 2.1 mm id - 3. 5{mu}m XTerra C18MS
AC$CHROMATOGRAPHY: COLUMN_TEMPERATURE 35 C
AC$CHROMATOGRAPHY: SAMPLING_CONE 15 V, 30 V

MS$DATA_PROCESSING: FIND_PEAK ignore rel.int. < 5

PK$SPLASH: splash10-014i-0000109000-d447259b1a51368be0df
PK$NUM_PEAK: 14
PK$PEAK: m/z int. rel.int.
  268 8 8
  366 12 12
  371 8 8
  421 12 12
  464 12 12
  492 188 188
  493 35 35
  508 8 8
  520 8 8
  524 16 16
  547 20 20
  618 999 999
  619 161 161
  620 24 24