ACCESSION: MSBNK-Waters-WA002851
RECORD_TITLE: 7-Aminoclonazepam; LC-ESI-Q; MS; POS; 30 V
DATE: 2016.01.19 (Created 2007.08.01, modified 2011.05.06)
AUTHORS: Nihon Waters K.K.
LICENSE: CC BY-NC

CH$NAME: 7-Aminoclonazepam
CH$COMPOUND_CLASS: N/A
CH$FORMULA: C15H12ClN3O
CH$EXACT_MASS: 285.06689
CH$SMILES: O=C(C2)Nc(c3)c(cc(N)c3)C(=N2)c(c1)c(Cl)ccc1
CH$IUPAC: InChI=1S/C15H12ClN3O/c16-12-4-2-1-3-10(12)15-11-7-9(17)5-6-13(11)19-14(20)8-18-15/h1-7H,8,17H2,(H,19,20)
CH$LINK: CAS 4959-17-5
CH$LINK: INCHIKEY HEFRPWRJTGLSSV-UHFFFAOYSA-N
CH$LINK: COMPTOX DTXSID90197913

AC$INSTRUMENT: ZQ, Waters
AC$INSTRUMENT_TYPE: LC-ESI-Q
AC$MASS_SPECTROMETRY: MS_TYPE MS
AC$MASS_SPECTROMETRY: ION_MODE POSITIVE
AC$MASS_SPECTROMETRY: IONIZATION ESI
AC$CHROMATOGRAPHY: RETENTION_TIME 12.110 min
AC$CHROMATOGRAPHY: COLUMN_NAME 2.1 mm id - 3. 5{mu}m XTerra C18MS
AC$CHROMATOGRAPHY: COLUMN_TEMPERATURE 35 C
AC$CHROMATOGRAPHY: SAMPLING_CONE 30 V

MS$DATA_PROCESSING: FIND_PEAK ignore rel.int. < 5

PK$SPLASH: splash10-000i-0090000000-2c67f4176f3596e40de4
PK$NUM_PEAK: 8
PK$PEAK: m/z int. rel.int.
  100 8 8
  250 8 8
  286 999 999
  287 137 137
  288 345 345
  289 47 47
  324 16 16
  326 8 8