ACCESSION: MSBNK-Waters-WA002870
RECORD_TITLE: 2,5-Dimethoxy-4-bromoamphetamine; LC-ESI-Q; MS; POS; 15 V
DATE: 2016.01.19 (Created 2007.08.01, modified 2011.05.06)
AUTHORS: Nihon Waters K.K.
LICENSE: CC BY-NC

CH$NAME: 2,5-Dimethoxy-4-bromoamphetamine
CH$COMPOUND_CLASS: N/A
CH$FORMULA: C11H16BrNO2
CH$EXACT_MASS: 273.03644
CH$SMILES: CC(N)Cc(c1)c(OC)cc(Br)c(OC)1
CH$IUPAC: InChI=1S/C11H16BrNO2/c1-7(13)4-8-5-11(15-3)9(12)6-10(8)14-2/h5-7H,4,13H2,1-3H3
CH$LINK: CAS 32156-26-6
CH$LINK: INCHIKEY FXMWUTGUCAKGQL-UHFFFAOYSA-N
CH$LINK: COMPTOX DTXSID5050428

AC$INSTRUMENT: ZQ, Waters
AC$INSTRUMENT_TYPE: LC-ESI-Q
AC$MASS_SPECTROMETRY: MS_TYPE MS
AC$MASS_SPECTROMETRY: ION_MODE POSITIVE
AC$MASS_SPECTROMETRY: IONIZATION ESI
AC$CHROMATOGRAPHY: RETENTION_TIME 12.600 min
AC$CHROMATOGRAPHY: COLUMN_NAME 2.1 mm id - 3. 5{mu}m XTerra C18MS
AC$CHROMATOGRAPHY: COLUMN_TEMPERATURE 35 C
AC$CHROMATOGRAPHY: SAMPLING_CONE 15 V

MS$DATA_PROCESSING: FIND_PEAK ignore rel.int. < 5

PK$SPLASH: splash10-00b9-0090000000-716a85e4057cdd86c3da
PK$NUM_PEAK: 15
PK$PEAK: m/z int. rel.int.
  163 24 24
  196 27 27
  212 12 12
  240 306 306
  241 35 35
  257 67 67
  259 71 71
  260 8 8
  274 983 983
  275 16 16
  276 999 999
  277 78 78
  315 16 16
  317 12 12
  549 12 12