ACCESSION: MSBNK-Waters-WA002886
RECORD_TITLE: N-1-(Hydroxyethyl)flurazepam; LC-ESI-Q; MS; POS; 75 V, 90 V
DATE: 2016.01.19 (Created 2007.08.01, modified 2011.05.06)
AUTHORS: Nihon Waters K.K.
LICENSE: CC BY-NC

CH$NAME: N-1-(Hydroxyethyl)flurazepam
CH$COMPOUND_CLASS: N/A
CH$FORMULA: C17H14ClFN2O2
CH$EXACT_MASS: 332.07278
CH$SMILES: OCCN(C(=O)2)c(c3)c(cc(Cl)c3)C(=NC2)c(c1)c(F)ccc1
CH$IUPAC: InChI=1S/C17H14ClFN2O2/c18-11-5-6-15-13(9-11)17(12-3-1-2-4-14(12)19)20-10-16(23)21(15)7-8-22/h1-6,9,22H,7-8,10H2
CH$LINK: CAS 20971-53-3
CH$LINK: INCHIKEY FOCBRQQHNOKOJQ-UHFFFAOYSA-N
CH$LINK: COMPTOX DTXSID10175152

AC$INSTRUMENT: ZQ, Waters
AC$INSTRUMENT_TYPE: LC-ESI-Q
AC$MASS_SPECTROMETRY: MS_TYPE MS
AC$MASS_SPECTROMETRY: ION_MODE POSITIVE
AC$MASS_SPECTROMETRY: IONIZATION ESI
AC$CHROMATOGRAPHY: RETENTION_TIME 15.400 min
AC$CHROMATOGRAPHY: COLUMN_NAME 2.1 mm id - 3. 5{mu}m XTerra C18MS
AC$CHROMATOGRAPHY: COLUMN_TEMPERATURE 35 C
AC$CHROMATOGRAPHY: SAMPLING_CONE 75 V, 90 V

MS$DATA_PROCESSING: FIND_PEAK ignore rel.int. < 5

PK$SPLASH: splash10-0bt9-0890000000-85d605e5531ba19ec98f
PK$NUM_PEAK: 141
PK$PEAK: m/z int. rel.int.
  109 999 999
  110 39 39
  113 8 8
  117 39 39
  118 8 8
  120 12 12
  121 8 8
  122 12 12
  123 192 192
  124 27 27
  125 55 55
  127 27 27
  130 90 90
  131 306 306
  132 20 20
  133 27 27
  134 51 51
  135 8 8
  136 12 12
  138 39 39
  139 12 12
  140 306 306
  141 98 98
  142 94 94
  143 31 31
  146 12 12
  148 12 12
  149 8 8
  150 67 67
  151 12 12
  152 27 27
  153 86 86
  154 24 24
  155 31 31
  156 20 20
  158 24 24
  159 24 24
  162 12 12
  163 8 8
  164 31 31
  165 78 78
  166 215 215
  167 47 47
  168 90 90
  169 12 12
  170 8 8
  179 12 12
  180 16 16
  181 8 8
  183 39 39
  184 106 106
  185 8 8
  186 24 24
  191 31 31
  193 12 12
  194 114 114
  195 12 12
  196 39 39
  197 12 12
  198 12 12
  199 12 12
  204 12 12
  205 27 27
  206 31 31
  207 16 16
  209 20 20
  210 12 12
  211 760 760
  212 129 129
  213 12 12
  214 82 82
  215 12 12
  216 31 31
  217 12 12
  219 24 24
  222 55 55
  223 43 43
  224 78 78
  225 208 208
  226 204 204
  227 27 27
  230 8 8
  232 47 47
  233 8 8
  234 31 31
  235 20 20
  236 35 35
  237 16 16
  238 8 8
  239 86 86
  240 110 110
  241 20 20
  242 31 31
  244 24 24
  245 59 59
  246 282 282
  247 51 51
  248 110 110
  249 16 16
  250 8 8
  251 35 35
  252 20 20
  253 16 16
  254 8 8
  258 67 67
  259 196 196
  260 145 145
  261 129 129
  262 55 55
  263 20 20
  267 12 12
  269 8 8
  270 51 51
  271 35 35
  272 31 31
  273 20 20
  274 20 20
  275 8 8
  276 12 12
  285 12 12
  287 63 63
  288 8 8
  289 172 172
  290 20 20
  291 47 47
  292 8 8
  302 8 8
  305 71 71
  306 8 8
  307 24 24
  315 90 90
  316 12 12
  317 31 31
  333 55 55
  334 8 8
  335 24 24
  355 31 31
  357 8 8
  359 8 8
  371 31 31
  373 16 16