ACCESSION: MSBNK-Waters-WA002904
RECORD_TITLE: Carbamazepine 10,11-epoxide; LC-ESI-Q; MS; POS; 45 V
DATE: 2016.01.19 (Created 2007.08.01, modified 2011.05.06)
AUTHORS: Nihon Waters K.K.
LICENSE: CC BY-NC

CH$NAME: Carbamazepine 10,11-epoxide
CH$COMPOUND_CLASS: N/A
CH$FORMULA: C15H12N2O2
CH$EXACT_MASS: 252.08988
CH$SMILES: NC(=O)N(c32)c(c4)c(ccc4)C(O1)C1c(cccc3)2
CH$IUPAC: InChI=1S/C15H12N2O2/c16-15(18)17-11-7-3-1-5-9(11)13-14(19-13)10-6-2-4-8-12(10)17/h1-8,13-14H,(H2,16,18)
CH$LINK: CAS 36507-30-9
CH$LINK: INCHIKEY ZRWWEEVEIOGMMT-UHFFFAOYSA-N
CH$LINK: COMPTOX DTXSID60891456

AC$INSTRUMENT: ZQ, Waters
AC$INSTRUMENT_TYPE: LC-ESI-Q
AC$MASS_SPECTROMETRY: MS_TYPE MS
AC$MASS_SPECTROMETRY: ION_MODE POSITIVE
AC$MASS_SPECTROMETRY: IONIZATION ESI
AC$CHROMATOGRAPHY: RETENTION_TIME 13.400 min
AC$CHROMATOGRAPHY: COLUMN_NAME 2.1 mm id - 3. 5{mu}m XTerra C18MS
AC$CHROMATOGRAPHY: COLUMN_TEMPERATURE 35 C
AC$CHROMATOGRAPHY: SAMPLING_CONE 45 V

MS$DATA_PROCESSING: FIND_PEAK ignore rel.int. < 5

PK$SPLASH: splash10-01q9-0790000000-4a45d3e105967f6871fa
PK$NUM_PEAK: 19
PK$PEAK: m/z int. rel.int.
  180 999 999
  181 149 149
  182 321 321
  183 39 39
  192 12 12
  208 78 78
  210 740 740
  211 94 94
  212 8 8
  236 317 317
  237 47 47
  253 121 121
  254 168 168
  255 20 20
  275 118 118
  276 20 20
  291 16 16
  316 8 8
  527 16 16