ACCESSION: MSBNK-Waters-WA002907
RECORD_TITLE: N-Desmethylmirtazapine; LC-ESI-Q; MS; POS; 90 V
DATE: 2016.01.19 (Created 2007.08.01, modified 2011.05.06)
AUTHORS: Nihon Waters K.K.
LICENSE: CC BY-NC

CH$NAME: N-Desmethylmirtazapine
CH$COMPOUND_CLASS: N/A
CH$FORMULA: C16H17N3
CH$EXACT_MASS: 251.14225
CH$SMILES: c(c4)cc(C1)c(n4)N(C3)C([H])(CNC3)c(c2)c(ccc2)1
CH$IUPAC: InChI=1S/C16H17N3/c1-2-6-14-12(4-1)10-13-5-3-7-18-16(13)19-9-8-17-11-15(14)19/h1-7,15,17H,8-11H2/t15-/m1/s1
CH$LINK: CAS 61337-68-6
CH$LINK: INCHIKEY FGLAMNFOHWVQOH-OAHLLOKOSA-N
CH$LINK: COMPTOX DTXSID001009942

AC$INSTRUMENT: ZQ, Waters
AC$INSTRUMENT_TYPE: LC-ESI-Q
AC$MASS_SPECTROMETRY: MS_TYPE MS
AC$MASS_SPECTROMETRY: ION_MODE POSITIVE
AC$MASS_SPECTROMETRY: IONIZATION ESI
AC$CHROMATOGRAPHY: RETENTION_TIME 11.600 min
AC$CHROMATOGRAPHY: COLUMN_NAME 2.1 mm id - 3. 5{mu}m XTerra C18MS
AC$CHROMATOGRAPHY: COLUMN_TEMPERATURE 35 C
AC$CHROMATOGRAPHY: SAMPLING_CONE 90 V

MS$DATA_PROCESSING: FIND_PEAK ignore rel.int. < 5

PK$SPLASH: splash10-015d-0910000000-5a9272b6482937b32c9e
PK$NUM_PEAK: 73
PK$PEAK: m/z int. rel.int.
  103 31 31
  104 16 16
  105 98 98
  106 20 20
  107 59 59
  110 94 94
  115 333 333
  116 55 55
  117 125 125
  118 31 31
  119 67 67
  121 35 35
  128 39 39
  129 43 43
  130 125 125
  131 118 118
  132 35 35
  133 47 47
  134 12 12
  140 12 12
  141 71 71
  142 20 20
  143 24 24
  144 20 20
  145 16 16
  146 16 16
  151 20 20
  152 133 133
  153 98 98
  154 55 55
  155 27 27
  156 24 24
  157 16 16
  158 20 20
  165 219 219
  166 78 78
  167 439 439
  168 227 227
  169 63 63
  170 12 12
  177 12 12
  178 98 98
  179 106 106
  180 470 470
  181 168 168
  182 125 125
  183 20 20
  190 12 12
  191 78 78
  192 114 114
  193 121 121
  194 701 701
  195 999 999
  196 114 114
  197 24 24
  204 12 12
  205 51 51
  206 78 78
  207 153 153
  208 55 55
  209 309 309
  210 31 31
  217 12 12
  218 20 20
  219 102 102
  220 27 27
  221 82 82
  222 16 16
  223 27 27
  233 20 20
  235 24 24
  252 125 125
  253 12 12