ACCESSION: MSBNK-Waters-WA002942
RECORD_TITLE: Ethylmorphine; LC-ESI-Q; MS; POS; 90 V
DATE: 2016.01.19 (Created 2007.08.01, modified 2011.05.06)
AUTHORS: Nihon Waters K.K.
LICENSE: CC BY-NC

CH$NAME: Ethylmorphine
CH$COMPOUND_CLASS: N/A
CH$FORMULA: C19H23NO3
CH$EXACT_MASS: 313.16779
CH$SMILES: CCOc(c5)c(O4)c(c(c5)1)C(C2)(C34)C([H])(C=CC(O)3)C(N(C)C2)C1
CH$IUPAC: InChI=1S/C19H23NO3/c1-3-22-15-7-4-11-10-13-12-5-6-14(21)18-19(12,8-9-20(13)2)16(11)17(15)23-18/h4-7,12-14,18,21H,3,8-10H2,1-2H3/t12-,13+,14-,18-,19-/m0/s1
CH$LINK: CAS 76-58-4
CH$LINK: INCHIKEY OGDVEMNWJVYAJL-LEPYJNQMSA-N
CH$LINK: COMPTOX DTXSID1046760

AC$INSTRUMENT: ZQ, Waters
AC$INSTRUMENT_TYPE: LC-ESI-Q
AC$MASS_SPECTROMETRY: MS_TYPE MS
AC$MASS_SPECTROMETRY: ION_MODE POSITIVE
AC$MASS_SPECTROMETRY: IONIZATION ESI
AC$CHROMATOGRAPHY: RETENTION_TIME 10.940 min
AC$CHROMATOGRAPHY: COLUMN_NAME 2.1 mm id - 3. 5{mu}m XTerra C18MS
AC$CHROMATOGRAPHY: COLUMN_TEMPERATURE 35 C
AC$CHROMATOGRAPHY: SAMPLING_CONE 90 V

MS$DATA_PROCESSING: FIND_PEAK ignore rel.int. < 5

PK$SPLASH: splash10-0rl0-0931000000-d8f93de4ce5384bd6692
PK$NUM_PEAK: 151
PK$PEAK: m/z int. rel.int.
  100 118 118
  103 31 31
  105 51 51
  107 47 47
  108 43 43
  111 8 8
  113 8 8
  115 106 106
  116 12 12
  117 118 118
  118 47 47
  119 20 20
  121 35 35
  123 157 157
  124 8 8
  126 35 35
  127 12 12
  128 98 98
  129 114 114
  130 12 12
  131 110 110
  132 35 35
  133 47 47
  134 16 16
  135 20 20
  136 8 8
  141 114 114
  142 20 20
  143 55 55
  144 106 106
  145 329 329
  146 31 31
  147 294 294
  148 27 27
  149 27 27
  151 20 20
  152 86 86
  153 717 717
  154 90 90
  155 439 439
  156 35 35
  157 509 509
  158 86 86
  159 74 74
  160 74 74
  161 67 67
  162 43 43
  163 12 12
  164 12 12
  165 690 690
  166 125 125
  167 59 59
  168 86 86
  169 94 94
  170 39 39
  171 286 286
  172 118 118
  173 243 243
  174 20 20
  175 102 102
  176 20 20
  177 20 20
  178 51 51
  179 90 90
  180 27 27
  181 772 772
  182 149 149
  183 458 458
  184 172 172
  185 435 435
  186 106 106
  187 78 78
  188 24 24
  189 47 47
  190 47 47
  191 125 125
  192 12 12
  193 172 172
  194 129 129
  195 67 67
  196 20 20
  197 141 141
  198 176 176
  199 239 239
  200 149 149
  201 282 282
  202 51 51
  203 31 31
  204 8 8
  205 20 20
  206 27 27
  207 59 59
  208 24 24
  209 337 337
  210 157 157
  211 298 298
  212 43 43
  213 243 243
  214 47 47
  215 31 31
  216 43 43
  218 16 16
  219 55 55
  220 31 31
  221 86 86
  222 39 39
  223 63 63
  224 39 39
  225 43 43
  226 125 125
  227 239 239
  228 47 47
  229 208 208
  230 24 24
  234 20 20
  235 16 16
  236 24 24
  237 67 67
  238 31 31
  239 129 129
  240 43 43
  241 12 12
  242 8 8
  244 8 8
  248 16 16
  250 27 27
  251 8 8
  252 39 39
  253 16 16
  254 8 8
  255 74 74
  256 16 16
  257 59 59
  258 8 8
  266 74 74
  267 43 43
  268 31 31
  285 8 8
  288 12 12
  296 20 20
  312 12 12
  314 999 999
  315 168 168
  316 12 12
  324 8 8
  331 12 12
  332 51 51
  333 8 8
  336 16 16
  352 71 71
  355 16 16