ACCESSION: MSBNK-Waters-WA002947
RECORD_TITLE: Hydrocortisone; LC-ESI-Q; MS; NEG; 90 V
DATE: 2016.01.19 (Created 2007.08.01, modified 2011.05.06)
AUTHORS: Nihon Waters K.K.
LICENSE: CC BY-NC

CH$NAME: (8S,9S,10R,11S,13S,14S,17R)-11,17-dihydroxy-17-(2-hydroxyacetyl)-10,13-dimethyl-2,6,7,8,9,11,12,14,15,16-decahydro-1H-cyclopenta[a]phenanthren-3-one
CH$NAME: Cortisol
CH$NAME: Hydrocortisone
CH$COMPOUND_CLASS: N/A
CH$FORMULA: C21H30O5
CH$EXACT_MASS: 362.20932
CH$SMILES: C[C@]12CCC(=O)C=C1CC[C@@H]3[C@@H]2[C@H](C[C@]4([C@H]3CC[C@@]4(C(=O)CO)O)C)O
CH$IUPAC: InChI=1S/C21H30O5/c1-19-7-5-13(23)9-12(19)3-4-14-15-6-8-21(26,17(25)11-22)20(15,2)10-16(24)18(14)19/h9,14-16,18,22,24,26H,3-8,10-11H2,1-2H3/t14-,15-,16-,18+,19-,20-,21-/m0/s1
CH$LINK: CAS 50-23-7 80562-38-5
CH$LINK: CHEBI 17650
CH$LINK: CHEMSPIDER 5551
CH$LINK: COMPTOX DTXSID7020714
CH$LINK: HMDB HMDB00063
CH$LINK: INCHIKEY JYGXADMDTFJGBT-VWUMJDOOSA-N
CH$LINK: KEGG C00735
CH$LINK: LIPIDMAPS LMST02030001
CH$LINK: NIKKAJI J1.908I
CH$LINK: PUBCHEM CID:5754

AC$INSTRUMENT: ZQ, Waters
AC$INSTRUMENT_TYPE: LC-ESI-Q
AC$MASS_SPECTROMETRY: MS_TYPE MS
AC$MASS_SPECTROMETRY: ION_MODE NEGATIVE
AC$MASS_SPECTROMETRY: IONIZATION ESI
AC$CHROMATOGRAPHY: RETENTION_TIME 13.640 min
AC$CHROMATOGRAPHY: COLUMN_NAME 2.1 mm id - 3. 5{mu}m XTerra C18MS
AC$CHROMATOGRAPHY: COLUMN_TEMPERATURE 35 C
AC$CHROMATOGRAPHY: SAMPLING_CONE 90 V

MS$DATA_PROCESSING: FIND_PEAK ignore rel.int. < 5

PK$SPLASH: splash10-0059-0942100000-04aa09a5c56090ecf83e
PK$NUM_PEAK: 62
PK$PEAK: m/z int. rel.int.
  107 184 184
  108 12 12
  109 39 39
  110 8 8
  111 12 12
  113 12 12
  119 8 8
  121 16 16
  123 94 94
  125 999 999
  126 71 71
  127 12 12
  133 8 8
  135 63 63
  137 129 129
  138 16 16
  139 8 8
  145 12 12
  147 8 8
  159 16 16
  161 39 39
  163 12 12
  165 8 8
  173 20 20
  174 31 31
  175 16 16
  179 8 8
  187 8 8
  189 184 184
  190 24 24
  195 12 12
  217 8 8
  227 8 8
  257 8 8
  267 8 8
  269 16 16
  271 8 8
  279 31 31
  280 8 8
  282 486 486
  283 102 102
  284 12 12
  295 12 12
  297 313 313
  298 74 74
  299 8 8
  301 16 16
  313 20 20
  315 43 43
  316 12 12
  325 8 8
  329 8 8
  331 290 290
  332 59 59
  333 8 8
  343 27 27
  361 8 8
  407 172 172
  408 47 47
  409 8 8
  459 82 82
  460 16 16