ACCESSION: MSBNK-Waters-WA002961
RECORD_TITLE: Modafinil; LC-ESI-Q; MS; POS; 45 V
DATE: 2016.01.19 (Created 2007.08.01, modified 2011.05.06)
AUTHORS: Nihon Waters K.K.
LICENSE: CC BY-NC

CH$NAME: Modafinil
CH$COMPOUND_CLASS: N/A
CH$FORMULA: C15H15NO2S
CH$EXACT_MASS: 273.08235
CH$SMILES: NC(=O)CS(=O)C(c(c2)cccc2)c(c1)cccc1
CH$IUPAC: InChI=1S/C15H15NO2S/c16-14(17)11-19(18)15(12-7-3-1-4-8-12)13-9-5-2-6-10-13/h1-10,15H,11H2,(H2,16,17)
CH$LINK: CAS 68693-11-8
CH$LINK: INCHIKEY YFGHCGITMMYXAQ-UHFFFAOYSA-N
CH$LINK: COMPTOX DTXSID0023329

AC$INSTRUMENT: ZQ, Waters
AC$INSTRUMENT_TYPE: LC-ESI-Q
AC$MASS_SPECTROMETRY: MS_TYPE MS
AC$MASS_SPECTROMETRY: ION_MODE POSITIVE
AC$MASS_SPECTROMETRY: IONIZATION ESI
AC$CHROMATOGRAPHY: RETENTION_TIME 13.970 min
AC$CHROMATOGRAPHY: COLUMN_NAME 2.1 mm id - 3. 5{mu}m XTerra C18MS
AC$CHROMATOGRAPHY: COLUMN_TEMPERATURE 35 C
AC$CHROMATOGRAPHY: SAMPLING_CONE 45 V

MS$DATA_PROCESSING: FIND_PEAK ignore rel.int. < 5

PK$SPLASH: splash10-014i-0900000000-1bc8ee7626f022ba6bd6
PK$NUM_PEAK: 11
PK$PEAK: m/z int. rel.int.
  129 121 121
  145 8 8
  152 341 341
  153 35 35
  165 306 306
  166 141 141
  167 999 999
  168 133 133
  169 12 12
  170 8 8
  296 27 27